{"text_format":"1","workbook":"xlsx","n_sheets":8,"sheets":["Workbook Guide","Episode List","Color Values","Graphs","30 Rock Season Info","Parks and Rec Season Info","The Office Season Info","Community Season Info"],"not_rendered":{"charts":9,"images":5,"macros":1,"external_links":0,"defined_names":100,"comments":0,"pivot_tables":7},"unopened":[],"bounds":{"document_bytes":16777216,"sheet_cells":100000,"rows_first":2000,"rows_last":500,"rows_between":2000,"halvings":0,"cell_chars":16384,"cell_head_chars":4096},"cells_cut":0,"cells_raw":0,"read":"whole","date_system":"1900"}

{"sheet":"Workbook Guide","index":0,"n_rows":53,"n_cols":18,"rows_kept":53,"cut":false,"hidden":false,"merged":[[26,2,27,9],[28,2,35,9],[26,0,35,1],[36,2,36,9],[37,2,57,9],[36,0,57,1],[7,12,7,15],[2,0,6,9],[2,12,5,13],[41,16,45,16],[36,17,45,17],[10,0,11,5],[12,0,13,5],[36,16,40,16],[31,16,35,16],[46,16,50,16],[51,16,55,16],[31,17,35,17],[46,17,50,17],[51,17,55,17],[8,12,8,15],[12,6,13,9],[10,6,11,9],[14,0,15,9],[23,2,25,9],[20,2,22,9],[20,0,22,1],[23,0,25,1],[19,0,19,1]]}
["NBC Thursday Night Lineup"]
["Description",null,null,null,null,null,null,null,null,null,null,null,"Macro-Enabled Workbook"]
["In the early 2010s, NBC's Thursday night lineup consisted of four sitcoms that, in the streaming age, remain immensely popular. During the COVID-19 lockdowns, I revisted these shows, and I wondered what it would be like to watch all the episodes in the order they aired, so I downloaded epsiode information from Wikipedia and put them in a spreadsheet. When I needed a sample dataset for my portfolio, I figured it was the perfect one to use!",null,null,null,null,null,null,null,null,null,null,null,"To access the features in the \"Color Values\" sheet, make sure this file ends with \".xlsx\" and that you select \"Enable Macros\" when opening the workbook."]
[]
[]
[]
[]
[]
[null,null,null,null,null,null,null,null,null,null,null,null,"Highlighted Skillsets"]
["Data Sources:",null,null,null,null,null,null,null,null,null,null,null,"Highlighted Skillset"]
["Episode Lists and season descripitions were downloaded from Wikipedia as .csv using this online tool:",null,null,null,null,null,"https://wikitable2csv.ggor.de/",null,null,null,null,null,"Data gathering",null,"Formulas Used In This Wokrbook"]
[null,null,null,null,null,null,null,null,null,null,null,null,"Data cleaning",null,"Formula","Sheet(s)"]
["Runtimes were added using information from the NBC schedule. When there were anomolies, this webpage of historical TV schedules was consulted:",null,null,null,null,null,"https://www.tvtango.com/listings/2012/05/17/kathy",null,null,null,null,null,"Data merging",null,"INDIRECT","\"Color Values\", \"Graphs\", \"Episode List"]
[null,null,null,null,null,null,null,null,null,null,null,null,null,null,"MAX","\"Color Values\""]
["Some information on Community Season 6 had to be added manually, as the show was picked up by a streaming platform owned by a seperate network for its final season.",null,null,null,null,null,null,null,null,null,null,null,null,null,"TEXT","\"Color Values\""]
{"$rows_left_out":39}
{"sheet":"Episode List","index":1,"n_rows":575,"n_cols":17,"rows_kept":575,"cut":false,"hidden":false,"merged":[]}
["Show","Season","Season Number","Season Title","No.overall","No. inseason","Title","Directed by","Written by","Originally Aired","Day","Timeslot","Prod.code","U.S. viewers(millions)","Running Order","Full Lineup?","TV Season"]
["The Office","Season 1",1,{"$f":"A2& \" S\" &C2","v":"The Office S1"},1,1,"\"Pilot\"","Ken Kwapis","Ricky Gervais & Stephen Merchant and Greg Daniels","2005-03-24",{"$f":"CHOOSE(WEEKDAY(J2),\"Sun\",\"Mon\",\"Tue\",\"Wed\",\"Thu\",\"Fri\",\"Sat\")","v":"Thu"},"21:30:00",1001,11.2,1,{"$f":"IF(AND(\n    COUNTIFS(A:A, A2, J:J, J2) = 1,\n    COUNTIFS(A:A, \"30 Rock\", J:J, J2) = 1,\n    COUNTIFS(A:A, \"The Office\", J:J, J2) = 1,\n    COUNTIFS(A:A, \"Community\", J:J, J2) = 1,\n    COUNTIFS(A:A, \"Parks and Rec\", J:J, J2) = 1\n), \"Yes\", \"\")","v":""},{"$f":"VLOOKUP(EpisodeList[[#This Row],[Season Number]], INDIRECT(\"'\" & EpisodeList[[#This Row],[Show]] & \" Season Info'!C2:J15\"), 8,1)","v":"2004-05"}]
["The Office","Season 1",1,{"$f":"A3& \" S\" &C3","v":"The Office S1"},2,2,"\"Diversity Day\"","Ken Kwapis","B. J. Novak","2005-03-29",{"$f":"CHOOSE(WEEKDAY(J3),\"Sun\",\"Mon\",\"Tue\",\"Wed\",\"Thu\",\"Fri\",\"Sat\")","v":"Tue"},"21:30:00",1002,6,2,"",{"$f":"VLOOKUP(EpisodeList[[#This Row],[Season Number]], INDIRECT(\"'\" & EpisodeList[[#This Row],[Show]] & \" Season Info'!C2:J15\"), 8,1)","v":"2004-05"}]
["The Office","Season 1",1,{"$f":"A4& \" S\" &C4","v":"The Office S1"},3,3,"\"Health Care\"","Ken Whittingham","Paul Lieberstein","2005-04-05",{"$f":"CHOOSE(WEEKDAY(J4),\"Sun\",\"Mon\",\"Tue\",\"Wed\",\"Thu\",\"Fri\",\"Sat\")","v":"Tue"},"21:30:00",1006,5.8,3,"",{"$f":"VLOOKUP(EpisodeList[[#This Row],[Season Number]], INDIRECT(\"'\" & EpisodeList[[#This Row],[Show]] & \" Season Info'!C2:J15\"), 8,1)","v":"2004-05"}]
["The Office","Season 1",1,{"$f":"A5& \" S\" &C5","v":"The Office S1"},4,4,"\"The Alliance\"","Bryan Gordon","Michael Schur","2005-04-12",{"$f":"CHOOSE(WEEKDAY(J5),\"Sun\",\"Mon\",\"Tue\",\"Wed\",\"Thu\",\"Fri\",\"Sat\")","v":"Tue"},"21:30:00",1004,5.4,4,"",{"$f":"VLOOKUP(EpisodeList[[#This Row],[Season Number]], INDIRECT(\"'\" & EpisodeList[[#This Row],[Show]] & \" Season Info'!C2:J15\"), 8,1)","v":"2004-05"}]
["The Office","Season 1",1,{"$f":"A6& \" S\" &C6","v":"The Office S1"},5,5,"\"Basketball\"","Greg Daniels","Greg Daniels","2005-04-19",{"$f":"CHOOSE(WEEKDAY(J6),\"Sun\",\"Mon\",\"Tue\",\"Wed\",\"Thu\",\"Fri\",\"Sat\")","v":"Tue"},"21:30:00",1005,5,5,"",{"$f":"VLOOKUP(EpisodeList[[#This Row],[Season Number]], INDIRECT(\"'\" & EpisodeList[[#This Row],[Show]] & \" Season Info'!C2:J15\"), 8,1)","v":"2004-05"}]
["The Office","Season 1",1,{"$f":"A7& \" S\" &C7","v":"The Office S1"},6,6,"\"Hot Girl\"","Amy Heckerling","Mindy Kaling","2005-04-26",{"$f":"CHOOSE(WEEKDAY(J7),\"Sun\",\"Mon\",\"Tue\",\"Wed\",\"Thu\",\"Fri\",\"Sat\")","v":"Tue"},"21:30:00",1003,4.8,6,"",{"$f":"VLOOKUP(EpisodeList[[#This Row],[Season Number]], INDIRECT(\"'\" & EpisodeList[[#This Row],[Show]] & \" Season Info'!C2:J15\"), 8,1)","v":"2004-05"}]
["The Office","Season 2",2,{"$f":"A8& \" S\" &C8","v":"The Office S2"},7,1,"\"The Dundies\"","Greg Daniels","Mindy Kaling","2005-09-20",{"$f":"CHOOSE(WEEKDAY(J8),\"Sun\",\"Mon\",\"Tue\",\"Wed\",\"Thu\",\"Fri\",\"Sat\")","v":"Tue"},"21:30:00",2003,9,7,"",{"$f":"VLOOKUP(EpisodeList[[#This Row],[Season Number]], INDIRECT(\"'\" & EpisodeList[[#This Row],[Show]] & \" Season Info'!C2:J15\"), 8,1)","v":"2005-06"}]
["The Office","Season 2",2,{"$f":"A9& \" S\" &C9","v":"The Office S2"},8,2,"\"Sexual Harassment\"","Ken Kwapis","B. J. Novak","2005-09-27",{"$f":"CHOOSE(WEEKDAY(J9),\"Sun\",\"Mon\",\"Tue\",\"Wed\",\"Thu\",\"Fri\",\"Sat\")","v":"Tue"},"21:30:00",2002,7.13,8,"",{"$f":"VLOOKUP(EpisodeList[[#This Row],[Season Number]], INDIRECT(\"'\" & EpisodeList[[#This Row],[Show]] & \" Season Info'!C2:J15\"), 8,1)","v":"2005-06"}]
["The Office","Season 2",2,{"$f":"A10& \" S\" &C10","v":"The Office S2"},9,3,"\"Office Olympics\"","Paul Feig","Michael Schur","2005-10-04",{"$f":"CHOOSE(WEEKDAY(J10),\"Sun\",\"Mon\",\"Tue\",\"Wed\",\"Thu\",\"Fri\",\"Sat\")","v":"Tue"},"21:30:00",2004,8.3000000000000007,9,"",{"$f":"VLOOKUP(EpisodeList[[#This Row],[Season Number]], INDIRECT(\"'\" & EpisodeList[[#This Row],[Show]] & \" Season Info'!C2:J15\"), 8,1)","v":"2005-06"}]
["The Office","Season 2",2,{"$f":"A11& \" S\" &C11","v":"The Office S2"},10,4,"\"The Fire\"","Ken Kwapis","B. J. Novak","2005-10-11",{"$f":"CHOOSE(WEEKDAY(J11),\"Sun\",\"Mon\",\"Tue\",\"Wed\",\"Thu\",\"Fri\",\"Sat\")","v":"Tue"},"21:30:00",2001,7.6,10,"",{"$f":"VLOOKUP(EpisodeList[[#This Row],[Season Number]], INDIRECT(\"'\" & EpisodeList[[#This Row],[Show]] & \" Season Info'!C2:J15\"), 8,1)","v":"2005-06"}]
["The Office","Season 2",2,{"$f":"A12& \" S\" &C12","v":"The Office S2"},11,5,"\"Halloween\"","Paul Feig","Greg Daniels","2005-10-18",{"$f":"CHOOSE(WEEKDAY(J12),\"Sun\",\"Mon\",\"Tue\",\"Wed\",\"Thu\",\"Fri\",\"Sat\")","v":"Tue"},"21:30:00",2006,8,11,"",{"$f":"VLOOKUP(EpisodeList[[#This Row],[Season Number]], INDIRECT(\"'\" & EpisodeList[[#This Row],[Show]] & \" Season Info'!C2:J15\"), 8,1)","v":"2005-06"}]
["The Office","Season 2",2,{"$f":"A13& \" S\" &C13","v":"The Office S2"},12,6,"\"The Fight\"","Ken Kwapis","Gene Stupnitsky & Lee Eisenberg","2005-11-01",{"$f":"CHOOSE(WEEKDAY(J13),\"Sun\",\"Mon\",\"Tue\",\"Wed\",\"Thu\",\"Fri\",\"Sat\")","v":"Tue"},"21:30:00",2007,7.9,12,"",{"$f":"VLOOKUP(EpisodeList[[#This Row],[Season Number]], INDIRECT(\"'\" & EpisodeList[[#This Row],[Show]] & \" Season Info'!C2:J15\"), 8,1)","v":"2005-06"}]
["The Office","Season 2",2,{"$f":"A14& \" S\" &C14","v":"The Office S2"},13,7,"\"The Client\"","Greg Daniels","Paul Lieberstein","2005-11-08",{"$f":"CHOOSE(WEEKDAY(J14),\"Sun\",\"Mon\",\"Tue\",\"Wed\",\"Thu\",\"Fri\",\"Sat\")","v":"Tue"},"21:30:00",2005,7.5,13,"",{"$f":"VLOOKUP(EpisodeList[[#This Row],[Season Number]], INDIRECT(\"'\" & EpisodeList[[#This Row],[Show]] & \" Season Info'!C2:J15\"), 8,1)","v":"2005-06"}]
["The Office","Season 2",2,{"$f":"A15& \" S\" &C15","v":"The Office S2"},14,8,"\"Performance Review\"","Paul Feig","Larry Wilmore","2005-11-15",{"$f":"CHOOSE(WEEKDAY(J15),\"Sun\",\"Mon\",\"Tue\",\"Wed\",\"Thu\",\"Fri\",\"Sat\")","v":"Tue"},"21:30:00",2009,8,14,"",{"$f":"VLOOKUP(EpisodeList[[#This Row],[Season Number]], INDIRECT(\"'\" & EpisodeList[[#This Row],[Show]] & \" Season Info'!C2:J15\"), 8,1)","v":"2005-06"}]
{"$rows_left_out":561}
{"sheet":"Color Values","index":2,"n_rows":29,"n_cols":26,"rows_kept":29,"cut":false,"hidden":false,"merged":[[16,2,16,3],[16,16,16,19],[16,20,16,21],[16,22,16,25],[1,0,1,3],[1,14,1,20],[1,21,1,25],[9,14,10,14],[4,16,4,18],[4,21,4,23]]}
["Gradient Tool",null,null,null,null,null,null,null,null,null,null,null,null,null,"Important Note on Macros",null,null,null,null,null,null,"Instructions For Use Without Macros"]
["This tool allows users to generate custom colors for each season of a TV show based on a gradient. After selecting a starting and ending color for each gradient, a custom code will find the HEX codes of user input, and custom formulas will create a gradient between those colors. These colors can then be applied to the \"Episode List\" table.",null,null,null,null,null,null,null,null,null,null,null,null,null,"This is a macro-enabled workbook, meaning it has the ability to run– and be edited by– custom scripts triggered by the buttons \"Generate Gradient\" and \"Apply to Episode List\".\n\nSome users may not have the ability to run macros in their version of Excel, or they may choose not to for security reasons. These users can still use some features of this worksheet– see directions to the right.",null,null,null,null,null,null,"Find your desired starting and ending colors for each gradients. Then, use an online tool to identify the HEX codes and type them manually into C9:D12. The HEX codes for the gradient colors in P9:Z12 will be generated automatically. However, the colors of those cells will not change to match the HEX codes. You can use these HEX codes to manually change cell colors in the \"Episode List\" sheet, if you desire."]
[]
["Instructions"]
["1)","Enter show names in cells A9:A12 (ensure it is spelled identically across all sheets in workbook)","2)","Use bucket tool to set color for first and last season of show.",null,null,null,null,null,null,null,null,null,null,null,"4)","Click \"generate gradient\". This should generate HEX codes for your selected colors and create a gradient of colors for each season of each show.",null,null,null,"5)","If you are happy with your gradient, click \"Apply to Episode List.\" This will color each row in the sheet \"Episode List\" according to its show and season. "]
[]
["Show & Color Input",null,null,null,null,null,null,null,null,null,null,null,null,null,"Color Generation Buttons"]
["TV Show","Number of Seasons\n(Calculated)","Start Gradient\n(First Season)","End Gradient\n(Last Season)","Start Red Value","End Red Value","Red Increment","Start Green Value","End Green Value","Green Increment","Start Blue Value","End Blue Value","Blue increment",null,"Season:",1,2,3,4,5,6,7,8,9,10,11]
["30 Rock",{"$f":"MAX(INDIRECT(\"'\" & 'Color Values'!A9 & \" Season Info'!C:C\"))","v":7},"#FBBACF","#D74F9E",{"$f":"TEXT(HEX2DEC(MID(C9,2,2)), \"00\")","v":"251"},{"$f":"TEXT(HEX2DEC(MID(D9,2,2)), \"00\")","v":"215"},{"$f":"ROUND((F9-E9)/B9,0)","v":-5},{"$f":"TEXT(HEX2DEC(MID(C9,4,2)), \"00\")","v":"186"},{"$f":"TEXT(HEX2DEC(MID(D9,4,2)), \"00\")","v":"79"},{"$f":"ROUND((I9-H9)/B9,0)","v":-15},{"$f":"TEXT(HEX2DEC(MID(C9,6,2)), \"00\")","v":"207"},{"$f":"TEXT(HEX2DEC(MID(D9,6,2)), \"00\")","v":"158"},{"$f":"ROUND((L9-K9)/B9,0)","v":-7},null,null,{"$f":"IF( P$8> $B9, \"\", \"#\" & IF(ISODD(LEN(DEC2HEX($E9+$G9*(P$8-1)))),\"0\",\"\")&DEC2HEX($E9+$G9*(P$8-1))&IF(ISODD(LEN(DEC2HEX($H9+$J9*(P$8-1)))),\"0\",\"\")&DEC2HEX($H9+$J9*(P$8-1))&IF(ISODD(LEN(DEC2HEX($K9+$M9*(P$8-1)))),\"0\",\"\")&DEC2HEX($K9+$M9*(P$8-1)))","v":"#FBBACF"},{"$f":"IF( Q$8> $B9, \"\", \"#\" & IF(ISODD(LEN(DEC2HEX($E9+$G9*(Q$8-1)))),\"0\",\"\")&DEC2HEX($E9+$G9*(Q$8-1))&IF(ISODD(LEN(DEC2HEX($H9+$J9*(Q$8-1)))),\"0\",\"\")&DEC2HEX($H9+$J9*(Q$8-1))&IF(ISODD(LEN(DEC2HEX($K9+$M9*(Q$8-1)))),\"0\",\"\")&DEC2HEX($K9+$M9*(Q$8-1)))","v":"#F6ABC8"},"#F19CC1","#EC8DBA","#E77EB3","#E26FAC","#DD60A5","","","",""]
["The Office",{"$f":"MAX(INDIRECT(\"'\" & 'Color Values'!A10 & \" Season Info'!C:C\"))","v":9},"#F7EBDD","#B5752F",{"$f":"TEXT(HEX2DEC(MID(C10,2,2)), \"00\")","v":"247"},{"$f":"TEXT(HEX2DEC(MID(D10,2,2)), \"00\")","v":"181"},{"$f":"ROUND((F10-E10)/B10,0)","v":-7},{"$f":"TEXT(HEX2DEC(MID(C10,4,2)), \"00\")","v":"235"},{"$f":"TEXT(HEX2DEC(MID(D10,4,2)), \"00\")","v":"117"},{"$f":"ROUND((I10-H10)/B10,0)","v":-13},{"$f":"TEXT(HEX2DEC(MID(C10,6,2)), \"00\")","v":"221"},{"$f":"TEXT(HEX2DEC(MID(D10,6,2)), \"00\")","v":"47"},{"$f":"ROUND((L10-K10)/B10,0)","v":-19},null,"Gradient",{"$f":"IF( P$8> $B10, \"\", \"#\" & IF(ISODD(LEN(DEC2HEX($E10+$G10*(P$8-1)))),\"0\",\"\")&DEC2HEX($E10+$G10*(P$8-1))&IF(ISODD(LEN(DEC2HEX($H10+$J10*(P$8-1)))),\"0\",\"\")&DEC2HEX($H10+$J10*(P$8-1))&IF(ISODD(LEN(DEC2HEX($K10+$M10*(P$8-1)))),\"0\",\"\")&DEC2HEX($K10+$M10*(P$8-1)))","v":"#F7EBDD"},"#F0DECA","#E9D1B7","#E2C4A4","#DBB791","#D4AA7E","#CD9D6B","#C69058","#BF8345","",""]
["Parks and Rec",{"$f":"MAX(INDIRECT(\"'\" & 'Color Values'!A11 & \" Season Info'!C:C\"))","v":7},"#DAEFE2","#358254","218","53",-24,"239","130",-16,"226","84",-20,null,null,"#DAEFE2","#C2DFCE","#AACFBA","#92BFA6","#7AAF92","#629F7E","#4A8F6A","","","",""]
["Community",{"$f":"MAX(INDIRECT(\"'\" & 'Color Values'!A12 & \" Season Info'!C:C\"))","v":6},"#D6E4FC","#1159C6","214",{"$f":"TEXT(HEX2DEC(MID(D12,2,2)), \"00\")","v":"17"},{"$f":"ROUND((F12-E12)/B12,0)","v":-33},"228",{"$f":"TEXT(HEX2DEC(MID(D12,4,2)), \"00\")","v":"89"},{"$f":"ROUND((I12-H12)/B12,0)","v":-23},"252",{"$f":"TEXT(HEX2DEC(MID(D12,6,2)), \"00\")","v":"198"},{"$f":"ROUND((L12-K12)/B12,0)","v":-9},null,null,"#D6E4FC","#B5CDF3","#94B6EA","#739FE1","#5288D8","#3171CF","","","","",""]
[]
[null,null,null,"Unhide to see helper columns -->",null,null,null,null,null,null,null,null,null,"<--"]
["Descriptions & Explanations:"]
{"$rows_left_out":15}
{"sheet":"Graphs","index":3,"n_rows":286,"n_cols":35,"rows_kept":286,"cut":false,"hidden":false,"merged":[[3,14,3,22]]}
[]
[]
[]
[null,null,null,null,null,null,null,null,null,null,null,null,null,null,"Percent of Total Viewership Per TV  Season\n(only nights with all 4 shows were considered)"]
[]
[]
[]
[]
[]
["Pivot Tables","Tables and source data are color-coded for conveinence.",null,null,null,null,null,null,null,null,null,null,null,null,null,null,null,null,null,null,"XLOOKUP Table"]
[]
["U.S. Viewership by Date",null,null,null,null,null,null,"U.S. Viewership by Season & Episode Number",null,null,null,null,null,null,"U.S. Viewership by Show",null,null,null,null,null,null,"Season Ranking by year/season"]
[]
[null,null,null,null,null,null,null,null,null,null,null,null,null,null,"Full Lineup?","Yes",null,null,null,null,null,null,"30 Rock",null,null,"The Office",null,null,"Parks and Rec",null,null,"Community"]
[null,null,null,null,null,null,null,null,null,null,null,null,null,null,null,null,null,null,null,null,null,"TV Season","Season","Avg. Viewers","Rank","Season","Avg. Viewers","Rank","Season","Avg. Viewers","Rank","Season","Avg. Viewers","Rank","Sum of Viewers"]
{"$rows_left_out":272}
{"sheet":"30 Rock Season Info","index":4,"n_rows":8,"n_cols":12,"rows_kept":8,"cut":false,"hidden":false,"merged":[]}
["Season Title","Show","Season","Timeslot (ET)","Episodes","Premiere Date","Premiere\nViewers\n(in millions)","Finale Date","Finale\nViewers\n(in millions)","TV Season","Rank","Avg. Viewers\n(in millions)"]
[{"$f":"B2 &\" S\" & C2","v":"30 Rock S1"},"30 Rock",1,"Wednesday 8:00 pm (October 11–November 1, 2006)\nThursday 9:30 pm (November 16, 2006–March 8, 2007)\nThursday 9:00 pm (April 5–26, 2007)",21,"2006-10-11",8.1300000000000008,"2007-04-26",4.72,"2006-07",102,5.8]
[{"$f":"B3 &\" S\" & C3","v":"30 Rock S2"},"30 Rock",2,"Thursday 8:30 pm (October 4, 2007–April 17, 2008)\nThursday 9:00 pm (December 13, 2007)\nThursday 9:30 pm (April 24–May 8, 2008)",15,"2007-10-04",7.33,"2008-05-08",5.45,"2007-08",111,6.5]
["30 Rock S3","30 Rock",3,"Thursday 9:30 pm (October 30, 2008–May 14, 2009)",22,"2008-10-30",8.66,"2009-05-14",5.7,"2008-09",69,7.5]
["30 Rock S4","30 Rock",4,"Thursday 9:30 pm (October 15, 2009–May 20, 2010)\nThursday 9:00 pm (January 14, 2010)\nThursday 8:30 pm (April 22, 2010)",22,"2009-10-15",6.39,"2010-05-20",5.36,"2009-10",86,5.9]
["30 Rock S5","30 Rock",5,"Thursday 8:30 pm (September 23 – December 9, 2010)\nThursday 10:00 pm (January 20 – May 5, 2011)\nThursday 10:30 pm (April 28, 2011)",23,"2010-09-23",5.91,"2011-05-05",4.2,"2010-11",106,5.3]
["30 Rock S6","30 Rock",6,"Thursday 8:00 pm (January 12 – March 8, 2012)\nThursday 9:00 pm (January 26, 2012)\nThursday 8:30 pm (March 15 – May 17, 2012)",22,"2012-01-12",4.47,"2012-05-17",2.84,"2011-12",130,4.5999999999999996]
["30 Rock S7","30 Rock",7,"Thursday 8:00 pm (October 4, 2012 – January 31, 2013)\nWednesday 8:00 pm (October 31, 2012)",13,"2012-10-04",3.46,"2013-01-31",4.88,"2012-13",99,4.5999999999999996]

{"sheet":"Parks and Rec Season Info","index":5,"n_rows":8,"n_cols":12,"rows_kept":8,"cut":false,"hidden":false,"merged":[]}
["Season Title","Show","Season","Timeslot (ET)","Episodes","Premiere Date","Premiere\nViewers\n(in millions)","Finale Date","Finale\nViewers\n(in millions)","TV Season","Rank","Avg. Viewers\n(in millions)"]
[{"$f":"B2 & \" S\" & C2","v":"Parks and Rec S1"},"Parks and Rec",1,"Thursday 8:30 pm",6,"April 9, 2009 (2009-04-09)",6.88,"May 14, 2009 (2009-05-14)",4.29,"2008-09",96,6]
[{"$f":"B3 & \" S\" & C3","v":"Parks and Rec S2"},"Parks and Rec",2,"Thursday 8:30 pm",24,"September 17, 2009 (2009-09-17)",4.8899999999999997,"May 20, 2010 (2010-05-20)",4.57,"2009-10",108,4.5999999999999996]
["Parks and Rec S3","Parks and Rec",3,"Thursday 9:30 pm",16,"January 20, 2011 (2011-01-20)",6.14,"May 19, 2011 (2011-05-19)",3.72,"2010-11",116,5.0999999999999996]
["Parks and Rec S4","Parks and Rec",4,"Thursday 8:30 pm (1–10)\nThursday 9:30 pm (11–22)",22,"September 22, 2011 (2011-09-22)",4.1100000000000003,"May 10, 2012 (2012-05-10)",3.42,"2011-12",134,4.4000000000000004]
["Parks and Rec S5","Parks and Rec",5,"Thursday 9:30 pm (1–9)\nThursday 8:30 pm (10–22)",22,"September 20, 2012 (2012-09-20)",3.5,"May 2, 2013 (2013-05-02)",2.99,"2012-13",111,4.0599999999999996]
["Parks and Rec S6","Parks and Rec",6,"Thursday 8:00 pm (1–9)\nThursday 8:30 pm (10–22)",22,"September 26, 2013 (2013-09-26)",3.27,"April 24, 2014 (2014-04-24)",2.71,"2013-14",115,3.76]
["Parks and Rec S7","Parks and Rec",7,"Tuesday 8:00 pm & 8:30 pm",13,"January 13, 2015 (2015-01-13)",3.75,"February 24, 2015 (2015-02-24)",4.1500000000000004,"2014-15",119,4.57]

{"sheet":"The Office Season Info","index":6,"n_rows":10,"n_cols":12,"rows_kept":10,"cut":false,"hidden":false,"merged":[]}
["Season Title","Show","Season","Timeslot (ET)","Episodes","Premiere Date","Premiere\nViewers\n(in millions)","Finale Date","Finale\nViewers\n(in millions)","TV Season","Rank","Avg. Viewers\n(in millions)"]
[{"$f":"B2 & \" S\" & C2","v":"The Office S1"},"The Office",1,"Thursday 9:30 pm (1)\nTuesday 9:30 pm (2 –6)",6,"March 24, 2005 (2005-03-24)",11.23,"April 26, 2005 (2005-04-26)",4.83,"2004-05",102,5.4]
[{"$f":"B3 & \" S\" & C3","v":"The Office S2"},"The Office",2,"Tuesday 9:30 pm (1 –10)\nThursday 9:30 pm (11 –22)",22,"September 20, 2005 (2005-09-20)",9,"May 11, 2006 (2006-05-11)",7.66,"2005-06",67,8]
["The Office S3","The Office",3,"Thursday 8:30 pm",25,"September 21, 2006 (2006-09-21)",9.11,"May 17, 2007 (2007-05-17)",7.88,"2006-07",68,8.3000000000000007]
["The Office S4","The Office",4,"Thursday 9:00 pm",19,"September 27, 2007 (2007-09-27)",9.65,"May 15, 2008 (2008-05-15)",8.2100000000000009,"2007-08",77,8.0399999999999991]
["The Office S5","The Office",5,"Thursday 9:00 pm",28,"September 25, 2008 (2008-09-25)",9.34,"May 14, 2009 (2009-05-14)",6.77,"2008-09",52,9.0399999999999991]
["The Office S6","The Office",6,"Thursday 9:00 pm",26,"September 17, 2009 (2009-09-17)",8.2100000000000009,"May 20, 2010 (2010-05-20)",6.64,"2009-10",41,8.73]
["The Office S7","The Office",7,"Thursday 9:00 pm",26,"September 23, 2010 (2010-09-23)",8.48,"May 19, 2011 (2011-05-19)",7.29,"2010-11",53,7.73]
["The Office S8","The Office",8,"Thursday 9:00 pm",24,"September 22, 2011 (2011-09-22)",7.64,"May 10, 2012 (2012-05-10)",4.49,"2011-12",78,6.51]
["The Office S9","The Office",9,"Thursday 9:00 pm",25,"September 20, 2012 (2012-09-20)",4.28,"May 16, 2013 (2013-05-16)",5.69,"2012-13",88,5.0599999999999996]

{"sheet":"Community Season Info","index":7,"n_rows":7,"n_cols":12,"rows_kept":7,"cut":false,"hidden":false,"merged":[]}
["Season Title","Show","Season","Timeslot (ET)","Episodes","Premiere Date","Premiere\nViewers\n(in millions)","Finale Date","Finale\nViewers\n(in millions)","TV Season","Rank","Avg. Viewers\n(in millions)"]
[{"$f":"B2 & \" S\" & C2","v":"Community S1"},"Community",1,"Thursday 9:30 pm (1 –3)\nThursday 8:00 pm (4 –25)",25,"September  17,  2009  (2009-09-17)",7.89,"May  20,  2010  (2010-05-20)",4.43,"2009-10",97,5]
[{"$f":"B3 & \" S\" & C3","v":"Community S2"},"Community",2,"Thursday 8:00 pm",24,"September  23,  2010  (2010-09-23)",5.01,"May  12,  2011  (2011-05-12)",3.32,"2010-11",138,4.4400000000000004]
["Community S3","Community",3,"Thursday 8:00 pm",22,"September  22,  2011  (2011-09-22)",3.93,"May  17,  2012  (2012-05-17)",2.48,"2011-12",144,4.03]
["Community S4","Community",4,"Thursday 8:00 pm",13,"February  7,  2013  (2013-02-07)",3.88,"May  9,  2013  (2013-05-09)",3.08,"2012-13",133,3.58]
["Community S5","Community",5,"Thursday 8:00 pm",13,"January  2,  2014  (2014-01-02)",3.49,"April  17,  2014  (2014-04-17)",2.87,"2013-14",96,3]
["Community S6","Community",6,"N/A",13,"March  17,  2015  (2015-03-17)",null,"June  2,  2015  (2015-06-02)",null,"2014-15"]