{"text_format":"1","workbook":"xlsx","n_sheets":8,"sheets":["Workbook Guide","Episode List","Color Values","Graphs","30 Rock Season Info","Parks and Rec Season Info","The Office Season Info","Community Season Info"],"not_rendered":{"charts":9,"images":5,"macros":1,"external_links":0,"defined_names":100,"comments":0,"pivot_tables":7},"unopened":[],"bounds":{"document_bytes":16777216,"sheet_cells":100000,"rows_first":2000,"rows_last":500,"rows_between":2000,"halvings":0,"cell_chars":16384,"cell_head_chars":4096},"cells_cut":0,"cells_raw":0,"read":"whole","date_system":"1900"}

{"sheet":"Workbook Guide","index":0,"n_rows":53,"n_cols":18,"rows_kept":53,"cut":false,"hidden":false,"merged":[[26,2,27,9],[28,2,35,9],[26,0,35,1],[36,2,36,9],[37,2,57,9],[36,0,57,1],[7,12,7,15],[2,0,6,9],[2,12,5,13],[41,16,45,16],[36,17,45,17],[10,0,11,5],[12,0,13,5],[36,16,40,16],[31,16,35,16],[46,16,50,16],[51,16,55,16],[31,17,35,17],[46,17,50,17],[51,17,55,17],[8,12,8,15],[12,6,13,9],[10,6,11,9],[14,0,15,9],[23,2,25,9],[20,2,22,9],[20,0,22,1],[23,0,25,1],[19,0,19,1]]}
["NBC Thursday Night Lineup"]
["Description",null,null,null,null,null,null,null,null,null,null,null,"Macro-Enabled Workbook"]
["In the early 2010s, NBC's Thursday night lineup consisted of four sitcoms that, in the streaming age, remain immensely popular. During the COVID-19 lockdowns, I revisted these shows, and I wondered what it would be like to watch all the episodes in the order they aired, so I downloaded epsiode information from Wikipedia and put them in a spreadsheet. When I needed a sample dataset for my portfolio, I figured it was the perfect one to use!",null,null,null,null,null,null,null,null,null,null,null,"To access the features in the \"Color Values\" sheet, make sure this file ends with \".xlsx\" and that you select \"Enable Macros\" when opening the workbook."]
[]
[]
[]
[]
[]
[null,null,null,null,null,null,null,null,null,null,null,null,"Highlighted Skillsets"]
["Data Sources:",null,null,null,null,null,null,null,null,null,null,null,"Highlighted Skillset"]
["Episode Lists and season descripitions were downloaded from Wikipedia as .csv using this online tool:",null,null,null,null,null,"https://wikitable2csv.ggor.de/",null,null,null,null,null,"Data gathering",null,"Formulas Used In This Wokrbook"]
[null,null,null,null,null,null,null,null,null,null,null,null,"Data cleaning",null,"Formula","Sheet(s)"]
["Runtimes were added using information from the NBC schedule. When there were anomolies, this webpage of historical TV schedules was consulted:",null,null,null,null,null,"https://www.tvtango.com/listings/2012/05/17/kathy",null,null,null,null,null,"Data merging",null,"INDIRECT","\"Color Values\", \"Graphs\", \"Episode List"]
[null,null,null,null,null,null,null,null,null,null,null,null,null,null,"MAX","\"Color Values\""]
["Some information on Community Season 6 had to be added manually, as the show was picked up by a streaming platform owned by a seperate network for its final season.",null,null,null,null,null,null,null,null,null,null,null,null,null,"TEXT","\"Color Values\""]
[null,null,null,null,null,null,null,null,null,null,null,null,null,null,"HEX2DEC","\"Color Values\""]
[null,null,null,null,null,null,null,null,null,null,null,null,null,null,"MID","\"Color Values\""]
[null,null,null,null,null,null,null,null,null,null,null,null,null,null,"ROUND","\"Color Values\""]
["Brief Worksheet Overview:",null,null,null,null,null,null,null,null,null,null,null,null,null,"IF","\"Color Values\""]
["Worksheet",null,"Description",null,null,null,null,null,null,null,null,null,null,null,"ISODD","\"Color Values\""]
["[Show] Season Info",null,"Each show has its own worksheet with a broad overview of information about each season such as start and end date, average viewership, and ranking.",null,null,null,null,null,null,null,null,null,null,null,"DEC2HEX","\"Color Values\""]
[null,null,null,null,null,null,null,null,null,null,null,null,null,null,"LEN","\"Graphs\""]
[null,null,null,null,null,null,null,null,null,null,null,null,null,null,"XLOOKUP","\"Graphs\""]
["Episode List",null,"Compiled table of information on every episode of all four TV shows. Includes information on air date, episode titles, writers, viewership, and timeslot. Configured with extensive conditional formatting (details below).",null,null,null,null,null,null,null,null,null,"Excel tables",null,"NA()","\"Graphs\""]
[null,null,null,null,null,null,null,null,null,null,null,null,"Conditional formatting",null,"SUM","\"Graphs\""]
[null,null,null,null,null,null,null,null,null,null,null,null,null,null,"AND","\"Episode List\""]
["Color Values",null,"This a supplementary tool to accomplish some conditional formatting in the Episode List sheet that Excel does not have built-in. Using this tool, users can color episodes from different seasons of a show using a gradient.",null,null,null,null,null,null,null,null,null,null,null,"COUNTIFS","\"Episode List\""]
[null,null,null,null,null,null,null,null,null,null,null,null,null,null,"VLOOKUP","\"Episode List\""]
[null,null,"Sample"]
[null,null,null,null,null,null,null,null,null,null,null,null,"Complex formulas",null,"Conditional Formatting Used in this Workbook"]
[null,null,null,null,null,null,null,null,null,null,null,null,"VBA macros",null,"Sheet","Range","Rule","Purpose"]
[null,null,null,null,null,null,null,null,null,null,null,null,"User interface",null,"Episode List","Table \"EpisodeList\"","Regardless of day, if there IS NOT an episode of any other show that aired at an earlier time on the same date, ad a solid black top border to the entire row.","Makes it visually easier to distinguish distinct dates in dataset."]
[null,null,null,null,null,null,null,null,null,null,null,null,null,null,null,"All columns"]
[]
[]
[]
["Graphs",null,"This sheet features multiple pivot tables and graphs based on viewership, timeslots, and season rankings.",null,null,null,null,null,null,null,null,null,null,null,"Episode List","Table \"EpisodeList\"","If the day is \"Thu\" and there IS NOT an episode of any other show that aired at an earlier time on the same date, color the cell dark gray and add a solid black border at the top","Makes the Thursday night lineup easier to identify at a glance."]
[null,null,"Samples",null,null,null,null,null,null,null,null,null,null,null,null,"Columns J & K"]
[null,null,null,null,null,null,null,null,null,null,null,null,null,null,null,"Columns O & P"]
[]
[]
[null,null,null,null,null,null,null,null,null,null,null,null,null,null,"Episode List","Table \"EpisodeList\"","If the day is \"Thu\" and there IS an episode of any other show that aired at an earlier time on the same date, color the cell light gray."]
[null,null,null,null,null,null,null,null,null,null,null,null,null,null,null,"Columns J & K"]
[null,null,null,null,null,null,null,null,null,null,null,null,null,null,null,"Columns O & P"]
[]
[]
[null,null,null,null,null,null,null,null,null,null,null,null,"Pivot tables",null,"Episode List","Table \"EpisodeList\"","Color the timeslot cell according to a gradient, where the earliest timeslot in the dataset is yellow and the latest timeslot in the dataset is dark blue.","Visualise day-to-day timeline. Also makes mistakes in running order easier to identify when cleaning data."]
[null,null,null,null,null,null,null,null,null,null,null,null,"Graphs",null,null,"Column L"]
[null,null,null,null,null,null,null,null,null,null,null,null,"Complex Formulas"]
[]
[]
[null,null,null,null,null,null,null,null,null,null,null,null,null,null,"Episode List","Table \"EpisodeList\"","Color the ratings cell according to a gradient where the highest ranked episode in the dataset is green, the lowest ranked episode in the dataset is red, and the 50th percentile is orange.","Visualise rankings relative to other shows in list."]
[null,null,null,null,null,null,null,null,null,null,null,null,null,null,null,"Column N"]

{"sheet":"Episode List","index":1,"n_rows":575,"n_cols":17,"rows_kept":575,"cut":false,"hidden":false,"merged":[]}
["Show","Season","Season Number","Season Title","No.overall","No. inseason","Title","Directed by","Written by","Originally Aired","Day","Timeslot","Prod.code","U.S. viewers(millions)","Running Order","Full Lineup?","TV Season"]
["The Office","Season 1",1,{"$f":"A2& \" S\" &C2","v":"The Office S1"},1,1,"\"Pilot\"","Ken Kwapis","Ricky Gervais & Stephen Merchant and Greg Daniels","2005-03-24",{"$f":"CHOOSE(WEEKDAY(J2),\"Sun\",\"Mon\",\"Tue\",\"Wed\",\"Thu\",\"Fri\",\"Sat\")","v":"Thu"},"21:30:00",1001,11.2,1,{"$f":"IF(AND(\n    COUNTIFS(A:A, A2, J:J, J2) = 1,\n    COUNTIFS(A:A, \"30 Rock\", J:J, J2) = 1,\n    COUNTIFS(A:A, \"The Office\", J:J, J2) = 1,\n    COUNTIFS(A:A, \"Community\", J:J, J2) = 1,\n    COUNTIFS(A:A, \"Parks and Rec\", J:J, J2) = 1\n), \"Yes\", \"\")","v":""},{"$f":"VLOOKUP(EpisodeList[[#This Row],[Season Number]], INDIRECT(\"'\" & EpisodeList[[#This Row],[Show]] & \" Season Info'!C2:J15\"), 8,1)","v":"2004-05"}]
["The Office","Season 1",1,{"$f":"A3& \" S\" &C3","v":"The Office S1"},2,2,"\"Diversity Day\"","Ken Kwapis","B. J. Novak","2005-03-29",{"$f":"CHOOSE(WEEKDAY(J3),\"Sun\",\"Mon\",\"Tue\",\"Wed\",\"Thu\",\"Fri\",\"Sat\")","v":"Tue"},"21:30:00",1002,6,2,"",{"$f":"VLOOKUP(EpisodeList[[#This Row],[Season Number]], INDIRECT(\"'\" & EpisodeList[[#This Row],[Show]] & \" Season Info'!C2:J15\"), 8,1)","v":"2004-05"}]
["The Office","Season 1",1,{"$f":"A4& \" S\" &C4","v":"The Office S1"},3,3,"\"Health Care\"","Ken Whittingham","Paul Lieberstein","2005-04-05",{"$f":"CHOOSE(WEEKDAY(J4),\"Sun\",\"Mon\",\"Tue\",\"Wed\",\"Thu\",\"Fri\",\"Sat\")","v":"Tue"},"21:30:00",1006,5.8,3,"",{"$f":"VLOOKUP(EpisodeList[[#This Row],[Season Number]], INDIRECT(\"'\" & EpisodeList[[#This Row],[Show]] & \" Season Info'!C2:J15\"), 8,1)","v":"2004-05"}]
["The Office","Season 1",1,{"$f":"A5& \" S\" &C5","v":"The Office S1"},4,4,"\"The Alliance\"","Bryan Gordon","Michael Schur","2005-04-12",{"$f":"CHOOSE(WEEKDAY(J5),\"Sun\",\"Mon\",\"Tue\",\"Wed\",\"Thu\",\"Fri\",\"Sat\")","v":"Tue"},"21:30:00",1004,5.4,4,"",{"$f":"VLOOKUP(EpisodeList[[#This Row],[Season Number]], INDIRECT(\"'\" & EpisodeList[[#This Row],[Show]] & \" Season Info'!C2:J15\"), 8,1)","v":"2004-05"}]
["The Office","Season 1",1,{"$f":"A6& \" S\" &C6","v":"The Office S1"},5,5,"\"Basketball\"","Greg Daniels","Greg Daniels","2005-04-19",{"$f":"CHOOSE(WEEKDAY(J6),\"Sun\",\"Mon\",\"Tue\",\"Wed\",\"Thu\",\"Fri\",\"Sat\")","v":"Tue"},"21:30:00",1005,5,5,"",{"$f":"VLOOKUP(EpisodeList[[#This Row],[Season Number]], INDIRECT(\"'\" & EpisodeList[[#This Row],[Show]] & \" Season Info'!C2:J15\"), 8,1)","v":"2004-05"}]
["The Office","Season 1",1,{"$f":"A7& \" S\" &C7","v":"The Office S1"},6,6,"\"Hot Girl\"","Amy Heckerling","Mindy Kaling","2005-04-26",{"$f":"CHOOSE(WEEKDAY(J7),\"Sun\",\"Mon\",\"Tue\",\"Wed\",\"Thu\",\"Fri\",\"Sat\")","v":"Tue"},"21:30:00",1003,4.8,6,"",{"$f":"VLOOKUP(EpisodeList[[#This Row],[Season Number]], INDIRECT(\"'\" & EpisodeList[[#This Row],[Show]] & \" Season Info'!C2:J15\"), 8,1)","v":"2004-05"}]
["The Office","Season 2",2,{"$f":"A8& \" S\" &C8","v":"The Office S2"},7,1,"\"The Dundies\"","Greg Daniels","Mindy Kaling","2005-09-20",{"$f":"CHOOSE(WEEKDAY(J8),\"Sun\",\"Mon\",\"Tue\",\"Wed\",\"Thu\",\"Fri\",\"Sat\")","v":"Tue"},"21:30:00",2003,9,7,"",{"$f":"VLOOKUP(EpisodeList[[#This Row],[Season Number]], INDIRECT(\"'\" & EpisodeList[[#This Row],[Show]] & \" Season Info'!C2:J15\"), 8,1)","v":"2005-06"}]
["The Office","Season 2",2,{"$f":"A9& \" S\" &C9","v":"The Office S2"},8,2,"\"Sexual Harassment\"","Ken Kwapis","B. J. Novak","2005-09-27",{"$f":"CHOOSE(WEEKDAY(J9),\"Sun\",\"Mon\",\"Tue\",\"Wed\",\"Thu\",\"Fri\",\"Sat\")","v":"Tue"},"21:30:00",2002,7.13,8,"",{"$f":"VLOOKUP(EpisodeList[[#This Row],[Season Number]], INDIRECT(\"'\" & EpisodeList[[#This Row],[Show]] & \" Season Info'!C2:J15\"), 8,1)","v":"2005-06"}]
["The Office","Season 2",2,{"$f":"A10& \" S\" &C10","v":"The Office S2"},9,3,"\"Office Olympics\"","Paul Feig","Michael Schur","2005-10-04",{"$f":"CHOOSE(WEEKDAY(J10),\"Sun\",\"Mon\",\"Tue\",\"Wed\",\"Thu\",\"Fri\",\"Sat\")","v":"Tue"},"21:30:00",2004,8.3000000000000007,9,"",{"$f":"VLOOKUP(EpisodeList[[#This Row],[Season Number]], INDIRECT(\"'\" & EpisodeList[[#This Row],[Show]] & \" Season Info'!C2:J15\"), 8,1)","v":"2005-06"}]
["The Office","Season 2",2,{"$f":"A11& \" S\" &C11","v":"The Office S2"},10,4,"\"The Fire\"","Ken Kwapis","B. J. Novak","2005-10-11",{"$f":"CHOOSE(WEEKDAY(J11),\"Sun\",\"Mon\",\"Tue\",\"Wed\",\"Thu\",\"Fri\",\"Sat\")","v":"Tue"},"21:30:00",2001,7.6,10,"",{"$f":"VLOOKUP(EpisodeList[[#This Row],[Season Number]], INDIRECT(\"'\" & EpisodeList[[#This Row],[Show]] & \" Season Info'!C2:J15\"), 8,1)","v":"2005-06"}]
["The Office","Season 2",2,{"$f":"A12& \" S\" &C12","v":"The Office S2"},11,5,"\"Halloween\"","Paul Feig","Greg Daniels","2005-10-18",{"$f":"CHOOSE(WEEKDAY(J12),\"Sun\",\"Mon\",\"Tue\",\"Wed\",\"Thu\",\"Fri\",\"Sat\")","v":"Tue"},"21:30:00",2006,8,11,"",{"$f":"VLOOKUP(EpisodeList[[#This Row],[Season Number]], INDIRECT(\"'\" & EpisodeList[[#This Row],[Show]] & \" Season Info'!C2:J15\"), 8,1)","v":"2005-06"}]
["The Office","Season 2",2,{"$f":"A13& \" S\" &C13","v":"The Office S2"},12,6,"\"The Fight\"","Ken Kwapis","Gene Stupnitsky & Lee Eisenberg","2005-11-01",{"$f":"CHOOSE(WEEKDAY(J13),\"Sun\",\"Mon\",\"Tue\",\"Wed\",\"Thu\",\"Fri\",\"Sat\")","v":"Tue"},"21:30:00",2007,7.9,12,"",{"$f":"VLOOKUP(EpisodeList[[#This Row],[Season Number]], INDIRECT(\"'\" & EpisodeList[[#This Row],[Show]] & \" Season Info'!C2:J15\"), 8,1)","v":"2005-06"}]
["The Office","Season 2",2,{"$f":"A14& \" S\" &C14","v":"The Office S2"},13,7,"\"The Client\"","Greg Daniels","Paul Lieberstein","2005-11-08",{"$f":"CHOOSE(WEEKDAY(J14),\"Sun\",\"Mon\",\"Tue\",\"Wed\",\"Thu\",\"Fri\",\"Sat\")","v":"Tue"},"21:30:00",2005,7.5,13,"",{"$f":"VLOOKUP(EpisodeList[[#This Row],[Season Number]], INDIRECT(\"'\" & EpisodeList[[#This Row],[Show]] & \" Season Info'!C2:J15\"), 8,1)","v":"2005-06"}]
["The Office","Season 2",2,{"$f":"A15& \" S\" &C15","v":"The Office S2"},14,8,"\"Performance Review\"","Paul Feig","Larry Wilmore","2005-11-15",{"$f":"CHOOSE(WEEKDAY(J15),\"Sun\",\"Mon\",\"Tue\",\"Wed\",\"Thu\",\"Fri\",\"Sat\")","v":"Tue"},"21:30:00",2009,8,14,"",{"$f":"VLOOKUP(EpisodeList[[#This Row],[Season Number]], INDIRECT(\"'\" & EpisodeList[[#This Row],[Show]] & \" Season Info'!C2:J15\"), 8,1)","v":"2005-06"}]
["The Office","Season 2",2,{"$f":"A16& \" S\" &C16","v":"The Office S2"},15,9,"\"Email Surveillance\"","Paul Feig","Jennifer Celotta","2005-11-22",{"$f":"CHOOSE(WEEKDAY(J16),\"Sun\",\"Mon\",\"Tue\",\"Wed\",\"Thu\",\"Fri\",\"Sat\")","v":"Tue"},"21:30:00",2008,8.1,15,"",{"$f":"VLOOKUP(EpisodeList[[#This Row],[Season Number]], INDIRECT(\"'\" & EpisodeList[[#This Row],[Show]] & \" Season Info'!C2:J15\"), 8,1)","v":"2005-06"}]
["The Office","Season 2",2,{"$f":"A17& \" S\" &C17","v":"The Office S2"},16,10,"\"Christmas Party\"","Charles McDougall","Michael Schur","2005-12-06",{"$f":"CHOOSE(WEEKDAY(J17),\"Sun\",\"Mon\",\"Tue\",\"Wed\",\"Thu\",\"Fri\",\"Sat\")","v":"Tue"},"21:30:00",2010,9.6999999999999993,16,"",{"$f":"VLOOKUP(EpisodeList[[#This Row],[Season Number]], INDIRECT(\"'\" & EpisodeList[[#This Row],[Show]] & \" Season Info'!C2:J15\"), 8,1)","v":"2005-06"}]
["The Office","Season 2",2,{"$f":"A18& \" S\" &C18","v":"The Office S2"},17,11,"\"Booze Cruise\"","Ken Kwapis","Greg Daniels","2006-01-05",{"$f":"CHOOSE(WEEKDAY(J18),\"Sun\",\"Mon\",\"Tue\",\"Wed\",\"Thu\",\"Fri\",\"Sat\")","v":"Thu"},"21:30:00",2013,8.6999999999999993,17,"",{"$f":"VLOOKUP(EpisodeList[[#This Row],[Season Number]], INDIRECT(\"'\" & EpisodeList[[#This Row],[Show]] & \" Season Info'!C2:J15\"), 8,1)","v":"2005-06"}]
["The Office","Season 2",2,{"$f":"A19& \" S\" &C19","v":"The Office S2"},18,12,"\"The Injury\"","Bryan Gordon","Mindy Kaling","2006-01-12",{"$f":"CHOOSE(WEEKDAY(J19),\"Sun\",\"Mon\",\"Tue\",\"Wed\",\"Thu\",\"Fri\",\"Sat\")","v":"Thu"},"21:30:00",2011,10.3,18,"",{"$f":"VLOOKUP(EpisodeList[[#This Row],[Season Number]], INDIRECT(\"'\" & EpisodeList[[#This Row],[Show]] & \" Season Info'!C2:J15\"), 8,1)","v":"2005-06"}]
["The Office","Season 2",2,{"$f":"A20& \" S\" &C20","v":"The Office S2"},19,13,"\"The Secret\"","Dennie Gordon","Lee Eisenberg & Gene Stupnitsky","2006-01-19",{"$f":"CHOOSE(WEEKDAY(J20),\"Sun\",\"Mon\",\"Tue\",\"Wed\",\"Thu\",\"Fri\",\"Sat\")","v":"Thu"},"21:30:00",2014,8.6999999999999993,19,"",{"$f":"VLOOKUP(EpisodeList[[#This Row],[Season Number]], INDIRECT(\"'\" & EpisodeList[[#This Row],[Show]] & \" Season Info'!C2:J15\"), 8,1)","v":"2005-06"}]
["The Office","Season 2",2,{"$f":"A21& \" S\" &C21","v":"The Office S2"},20,14,"\"The Carpet\"","Victor Nelli, Jr.","Paul Lieberstein","2006-01-26",{"$f":"CHOOSE(WEEKDAY(J21),\"Sun\",\"Mon\",\"Tue\",\"Wed\",\"Thu\",\"Fri\",\"Sat\")","v":"Thu"},"21:30:00",2012,8.6,20,"",{"$f":"VLOOKUP(EpisodeList[[#This Row],[Season Number]], INDIRECT(\"'\" & EpisodeList[[#This Row],[Show]] & \" Season Info'!C2:J15\"), 8,1)","v":"2005-06"}]
["The Office","Season 2",2,{"$f":"A22& \" S\" &C22","v":"The Office S2"},21,15,"\"Boys and Girls\"","Dennie Gordon","B. J. Novak","2006-02-02",{"$f":"CHOOSE(WEEKDAY(J22),\"Sun\",\"Mon\",\"Tue\",\"Wed\",\"Thu\",\"Fri\",\"Sat\")","v":"Thu"},"21:30:00",2015,5.42,21,"",{"$f":"VLOOKUP(EpisodeList[[#This Row],[Season Number]], INDIRECT(\"'\" & EpisodeList[[#This Row],[Show]] & \" Season Info'!C2:J15\"), 8,1)","v":"2005-06"}]
["The Office","Season 2",2,{"$f":"A23& \" S\" &C23","v":"The Office S2"},22,16,"\"Valentine's Day\"","Greg Daniels","Michael Schur","2006-02-09",{"$f":"CHOOSE(WEEKDAY(J23),\"Sun\",\"Mon\",\"Tue\",\"Wed\",\"Thu\",\"Fri\",\"Sat\")","v":"Thu"},"21:30:00",2016,8.9499999999999993,22,"",{"$f":"VLOOKUP(EpisodeList[[#This Row],[Season Number]], INDIRECT(\"'\" & EpisodeList[[#This Row],[Show]] & \" Season Info'!C2:J15\"), 8,1)","v":"2005-06"}]
["The Office","Season 2",2,{"$f":"A24& \" S\" &C24","v":"The Office S2"},23,17,"\"Dwight's Speech\"","Charles McDougall","Paul Lieberstein","2006-03-02",{"$f":"CHOOSE(WEEKDAY(J24),\"Sun\",\"Mon\",\"Tue\",\"Wed\",\"Thu\",\"Fri\",\"Sat\")","v":"Thu"},"21:30:00",2017,8.4,23,"",{"$f":"VLOOKUP(EpisodeList[[#This Row],[Season Number]], INDIRECT(\"'\" & EpisodeList[[#This Row],[Show]] & \" Season Info'!C2:J15\"), 8,1)","v":"2005-06"}]
["The Office","Season 2",2,{"$f":"A25& \" S\" &C25","v":"The Office S2"},24,18,"\"Take Your Daughter to Work Day\"","Victor Nelli, Jr.","Mindy Kaling","2006-03-16",{"$f":"CHOOSE(WEEKDAY(J25),\"Sun\",\"Mon\",\"Tue\",\"Wed\",\"Thu\",\"Fri\",\"Sat\")","v":"Thu"},"21:30:00",2018,8.8000000000000007,24,"",{"$f":"VLOOKUP(EpisodeList[[#This Row],[Season Number]], INDIRECT(\"'\" & EpisodeList[[#This Row],[Show]] & \" Season Info'!C2:J15\"), 8,1)","v":"2005-06"}]
["The Office","Season 2",2,{"$f":"A26& \" S\" &C26","v":"The Office S2"},25,19,"\"Michael's Birthday\"","Ken Whittingham","Gene Stupnitsky & Lee Eisenberg","2006-03-30",{"$f":"CHOOSE(WEEKDAY(J26),\"Sun\",\"Mon\",\"Tue\",\"Wed\",\"Thu\",\"Fri\",\"Sat\")","v":"Thu"},"21:30:00",2019,7.8,25,"",{"$f":"VLOOKUP(EpisodeList[[#This Row],[Season Number]], INDIRECT(\"'\" & EpisodeList[[#This Row],[Show]] & \" Season Info'!C2:J15\"), 8,1)","v":"2005-06"}]
["The Office","Season 2",2,{"$f":"A27& \" S\" &C27","v":"The Office S2"},26,20,"\"Drug Testing\"","Greg Daniels","Jennifer Celotta","2006-04-27",{"$f":"CHOOSE(WEEKDAY(J27),\"Sun\",\"Mon\",\"Tue\",\"Wed\",\"Thu\",\"Fri\",\"Sat\")","v":"Thu"},"21:30:00",2022,7.8,26,"",{"$f":"VLOOKUP(EpisodeList[[#This Row],[Season Number]], INDIRECT(\"'\" & EpisodeList[[#This Row],[Show]] & \" Season Info'!C2:J15\"), 8,1)","v":"2005-06"}]
["The Office","Season 2",2,{"$f":"A28& \" S\" &C28","v":"The Office S2"},27,21,"\"Conflict Resolution\"","Charles McDougall","Greg Daniels","2006-05-04",{"$f":"CHOOSE(WEEKDAY(J28),\"Sun\",\"Mon\",\"Tue\",\"Wed\",\"Thu\",\"Fri\",\"Sat\")","v":"Thu"},"21:30:00",2020,7.4,27,"",{"$f":"VLOOKUP(EpisodeList[[#This Row],[Season Number]], INDIRECT(\"'\" & EpisodeList[[#This Row],[Show]] & \" Season Info'!C2:J15\"), 8,1)","v":"2005-06"}]
["The Office","Season 2",2,{"$f":"A29& \" S\" &C29","v":"The Office S2"},28,22,"\"Casino Night\"","Ken Kwapis","Steve Carell","2006-05-11",{"$f":"CHOOSE(WEEKDAY(J29),\"Sun\",\"Mon\",\"Tue\",\"Wed\",\"Thu\",\"Fri\",\"Sat\")","v":"Thu"},"21:30:00",2021,7.6,28,"",{"$f":"VLOOKUP(EpisodeList[[#This Row],[Season Number]], INDIRECT(\"'\" & EpisodeList[[#This Row],[Show]] & \" Season Info'!C2:J15\"), 8,1)","v":"2005-06"}]
["The Office","Season 3",3,{"$f":"A30& \" S\" &C30","v":"The Office S3"},29,1,"\"Gay Witch Hunt\"","Ken Kwapis","Greg Daniels","2006-09-21",{"$f":"CHOOSE(WEEKDAY(J30),\"Sun\",\"Mon\",\"Tue\",\"Wed\",\"Thu\",\"Fri\",\"Sat\")","v":"Thu"},"20:30:00",3001,9.11,29,"",{"$f":"VLOOKUP(EpisodeList[[#This Row],[Season Number]], INDIRECT(\"'\" & EpisodeList[[#This Row],[Show]] & \" Season Info'!C2:J15\"), 8,1)","v":"2006-07"}]
["The Office","Season 3",3,{"$f":"A31& \" S\" &C31","v":"The Office S3"},30,2,"\"The Convention\"","Ken Whittingham","Gene Stupnitsky & Lee Eisenberg","2006-09-28",{"$f":"CHOOSE(WEEKDAY(J31),\"Sun\",\"Mon\",\"Tue\",\"Wed\",\"Thu\",\"Fri\",\"Sat\")","v":"Thu"},"20:30:00",3006,7.78,30,"",{"$f":"VLOOKUP(EpisodeList[[#This Row],[Season Number]], INDIRECT(\"'\" & EpisodeList[[#This Row],[Show]] & \" Season Info'!C2:J15\"), 8,1)","v":"2006-07"}]
["The Office","Season 3",3,{"$f":"A32& \" S\" &C32","v":"The Office S3"},31,3,"\"The Coup\"","Greg Daniels","Paul Lieberstein","2006-10-05",{"$f":"CHOOSE(WEEKDAY(J32),\"Sun\",\"Mon\",\"Tue\",\"Wed\",\"Thu\",\"Fri\",\"Sat\")","v":"Thu"},"20:30:00",3002,8.89,31,"",{"$f":"VLOOKUP(EpisodeList[[#This Row],[Season Number]], INDIRECT(\"'\" & EpisodeList[[#This Row],[Show]] & \" Season Info'!C2:J15\"), 8,1)","v":"2006-07"}]
["30 Rock","Season 1",1,{"$f":"A33& \" S\" &C33","v":"30 Rock S1"},1,1,"\"Pilot\"","Adam Bernstein","Tina Fey","2006-10-11",{"$f":"CHOOSE(WEEKDAY(J33),\"Sun\",\"Mon\",\"Tue\",\"Wed\",\"Thu\",\"Fri\",\"Sat\")","v":"Wed"},"20:00:00",101,8.1,32,"",{"$f":"VLOOKUP(EpisodeList[[#This Row],[Season Number]], INDIRECT(\"'\" & EpisodeList[[#This Row],[Show]] & \" Season Info'!C2:J15\"), 8,1)","v":"2006-07"}]
["The Office","Season 3",3,{"$f":"A34& \" S\" &C34","v":"The Office S3"},32,4,"\"Grief Counseling\"","Roger Nygard","Jennifer Celotta","2006-10-12",{"$f":"CHOOSE(WEEKDAY(J34),\"Sun\",\"Mon\",\"Tue\",\"Wed\",\"Thu\",\"Fri\",\"Sat\")","v":"Thu"},"20:30:00",3003,8.83,33,"",{"$f":"VLOOKUP(EpisodeList[[#This Row],[Season Number]], INDIRECT(\"'\" & EpisodeList[[#This Row],[Show]] & \" Season Info'!C2:J15\"), 8,1)","v":"2006-07"}]
["30 Rock","Season 1",1,{"$f":"A35& \" S\" &C35","v":"30 Rock S1"},2,2,"\"The Aftermath\"","Adam Bernstein","Tina Fey","2006-10-18",{"$f":"CHOOSE(WEEKDAY(J35),\"Sun\",\"Mon\",\"Tue\",\"Wed\",\"Thu\",\"Fri\",\"Sat\")","v":"Wed"},"20:00:00",102,5.7,34,"",{"$f":"VLOOKUP(EpisodeList[[#This Row],[Season Number]], INDIRECT(\"'\" & EpisodeList[[#This Row],[Show]] & \" Season Info'!C2:J15\"), 8,1)","v":"2006-07"}]
["The Office","Season 3",3,{"$f":"A36& \" S\" &C36","v":"The Office S3"},33,5,"\"Initiation\"","Randall Einhorn","B. J. Novak","2006-10-19",{"$f":"CHOOSE(WEEKDAY(J36),\"Sun\",\"Mon\",\"Tue\",\"Wed\",\"Thu\",\"Fri\",\"Sat\")","v":"Thu"},"20:30:00",3005,8.4600000000000009,35,"",{"$f":"VLOOKUP(EpisodeList[[#This Row],[Season Number]], INDIRECT(\"'\" & EpisodeList[[#This Row],[Show]] & \" Season Info'!C2:J15\"), 8,1)","v":"2006-07"}]
["30 Rock","Season 1",1,{"$f":"A37& \" S\" &C37","v":"30 Rock S1"},3,3,"\"Blind Date\"","Adam Bernstein","John Riggi","2006-10-25",{"$f":"CHOOSE(WEEKDAY(J37),\"Sun\",\"Mon\",\"Tue\",\"Wed\",\"Thu\",\"Fri\",\"Sat\")","v":"Wed"},"20:00:00",103,6,36,"",{"$f":"VLOOKUP(EpisodeList[[#This Row],[Season Number]], INDIRECT(\"'\" & EpisodeList[[#This Row],[Show]] & \" Season Info'!C2:J15\"), 8,1)","v":"2006-07"}]
["30 Rock","Season 1",1,{"$f":"A38& \" S\" &C38","v":"30 Rock S1"},4,4,"\"Jack the Writer\"","Gail Mancuso","Robert Carlock","2006-11-01",{"$f":"CHOOSE(WEEKDAY(J38),\"Sun\",\"Mon\",\"Tue\",\"Wed\",\"Thu\",\"Fri\",\"Sat\")","v":"Wed"},"20:00:00",104,4.5999999999999996,37,"",{"$f":"VLOOKUP(EpisodeList[[#This Row],[Season Number]], INDIRECT(\"'\" & EpisodeList[[#This Row],[Show]] & \" Season Info'!C2:J15\"), 8,1)","v":"2006-07"}]
["The Office","Season 3",3,{"$f":"A39& \" S\" &C39","v":"The Office S3"},34,6,"\"Diwali\"","Miguel Arteta","Mindy Kaling","2006-11-02",{"$f":"CHOOSE(WEEKDAY(J39),\"Sun\",\"Mon\",\"Tue\",\"Wed\",\"Thu\",\"Fri\",\"Sat\")","v":"Thu"},"20:30:00",3004,8.81,38,"",{"$f":"VLOOKUP(EpisodeList[[#This Row],[Season Number]], INDIRECT(\"'\" & EpisodeList[[#This Row],[Show]] & \" Season Info'!C2:J15\"), 8,1)","v":"2006-07"}]
["The Office","Season 3",3,{"$f":"A40& \" S\" &C40","v":"The Office S3"},35,7,"\"Branch Closing\"","Tucker Gates","Michael Schur","2006-11-09",{"$f":"CHOOSE(WEEKDAY(J40),\"Sun\",\"Mon\",\"Tue\",\"Wed\",\"Thu\",\"Fri\",\"Sat\")","v":"Thu"},"20:30:00",3007,8.0500000000000007,39,"",{"$f":"VLOOKUP(EpisodeList[[#This Row],[Season Number]], INDIRECT(\"'\" & EpisodeList[[#This Row],[Show]] & \" Season Info'!C2:J15\"), 8,1)","v":"2006-07"}]
["The Office","Season 3",3,{"$f":"A41& \" S\" &C41","v":"The Office S3"},36,8,"\"The Merger\"","Ken Whittingham","Brent Forrester","2006-11-16",{"$f":"CHOOSE(WEEKDAY(J41),\"Sun\",\"Mon\",\"Tue\",\"Wed\",\"Thu\",\"Fri\",\"Sat\")","v":"Thu"},"20:30:00",3008,8.6300000000000008,40,"",{"$f":"VLOOKUP(EpisodeList[[#This Row],[Season Number]], INDIRECT(\"'\" & EpisodeList[[#This Row],[Show]] & \" Season Info'!C2:J15\"), 8,1)","v":"2006-07"}]
["30 Rock","Season 1",1,{"$f":"A42& \" S\" &C42","v":"30 Rock S1"},5,5,"\"Jack-Tor\"","Don Scardino","Robert Carlock","2006-11-16",{"$f":"CHOOSE(WEEKDAY(J42),\"Sun\",\"Mon\",\"Tue\",\"Wed\",\"Thu\",\"Fri\",\"Sat\")","v":"Thu"},"21:30:00",105,5.2,41,"",{"$f":"VLOOKUP(EpisodeList[[#This Row],[Season Number]], INDIRECT(\"'\" & EpisodeList[[#This Row],[Show]] & \" Season Info'!C2:J15\"), 8,1)","v":"2006-07"}]
["The Office","Season 3",3,{"$f":"A43& \" S\" &C43","v":"The Office S3"},37,9,"\"The Convict\"","Jeffrey Blitz","Ricky Gervais & Stephen Merchant","2006-11-30",{"$f":"CHOOSE(WEEKDAY(J43),\"Sun\",\"Mon\",\"Tue\",\"Wed\",\"Thu\",\"Fri\",\"Sat\")","v":"Thu"},"20:30:00",3010,9.07,42,"",{"$f":"VLOOKUP(EpisodeList[[#This Row],[Season Number]], INDIRECT(\"'\" & EpisodeList[[#This Row],[Show]] & \" Season Info'!C2:J15\"), 8,1)","v":"2006-07"}]
["30 Rock","Season 1",1,{"$f":"A44& \" S\" &C44","v":"30 Rock S1"},6,6,"\"Jack Meets Dennis\"","Juan J. Campanella","Jack Burditt","2006-11-30",{"$f":"CHOOSE(WEEKDAY(J44),\"Sun\",\"Mon\",\"Tue\",\"Wed\",\"Thu\",\"Fri\",\"Sat\")","v":"Thu"},"21:30:00",106,6,43,"",{"$f":"VLOOKUP(EpisodeList[[#This Row],[Season Number]], INDIRECT(\"'\" & EpisodeList[[#This Row],[Show]] & \" Season Info'!C2:J15\"), 8,1)","v":"2006-07"}]
["30 Rock","Season 1",1,{"$f":"A45& \" S\" &C45","v":"30 Rock S1"},7,7,"\"Tracy Does Conan\"","Adam Bernstein","Tina Fey","2006-12-07",{"$f":"CHOOSE(WEEKDAY(J45),\"Sun\",\"Mon\",\"Tue\",\"Wed\",\"Thu\",\"Fri\",\"Sat\")","v":"Thu"},"21:30:00",107,6.8,44,"",{"$f":"VLOOKUP(EpisodeList[[#This Row],[Season Number]], INDIRECT(\"'\" & EpisodeList[[#This Row],[Show]] & \" Season Info'!C2:J15\"), 8,1)","v":"2006-07"}]
["The Office","Season 3",3,{"$f":"A46& \" S\" &C46","v":"The Office S3"},38,10,"\"A Benihana Christmas\"","Harold Ramis","Jennifer Celotta","2006-12-14",{"$f":"CHOOSE(WEEKDAY(J46),\"Sun\",\"Mon\",\"Tue\",\"Wed\",\"Thu\",\"Fri\",\"Sat\")","v":"Thu"},"20:30:00",3009,8.44,45,"",{"$f":"VLOOKUP(EpisodeList[[#This Row],[Season Number]], INDIRECT(\"'\" & EpisodeList[[#This Row],[Show]] & \" Season Info'!C2:J15\"), 8,1)","v":"2006-07"}]
["The Office","Season 3",3,{"$f":"A47& \" S\" &C47","v":"The Office S3"},39,11,"\"A Benihana Christmas\"","Harold Ramis","Jennifer Celotta","2006-12-14",{"$f":"CHOOSE(WEEKDAY(J47),\"Sun\",\"Mon\",\"Tue\",\"Wed\",\"Thu\",\"Fri\",\"Sat\")","v":"Thu"},"21:00:00",3014,8.44,46,"",{"$f":"VLOOKUP(EpisodeList[[#This Row],[Season Number]], INDIRECT(\"'\" & EpisodeList[[#This Row],[Show]] & \" Season Info'!C2:J15\"), 8,1)","v":"2006-07"}]
["30 Rock","Season 1",1,{"$f":"A48& \" S\" &C48","v":"30 Rock S1"},8,8,"\"The Break-Up\"","Scott Ellis","Dave Finkel & Brett Baer","2006-12-14",{"$f":"CHOOSE(WEEKDAY(J48),\"Sun\",\"Mon\",\"Tue\",\"Wed\",\"Thu\",\"Fri\",\"Sat\")","v":"Thu"},"21:30:00",108,5.9,47,"",{"$f":"VLOOKUP(EpisodeList[[#This Row],[Season Number]], INDIRECT(\"'\" & EpisodeList[[#This Row],[Show]] & \" Season Info'!C2:J15\"), 8,1)","v":"2006-07"}]
["The Office","Season 3",3,{"$f":"A49& \" S\" &C49","v":"The Office S3"},40,12,"\"Back from Vacation\"","Julian Farino","Justin Spitzer","2007-01-04",{"$f":"CHOOSE(WEEKDAY(J49),\"Sun\",\"Mon\",\"Tue\",\"Wed\",\"Thu\",\"Fri\",\"Sat\")","v":"Thu"},"20:30:00",3011,8.8000000000000007,48,"",{"$f":"VLOOKUP(EpisodeList[[#This Row],[Season Number]], INDIRECT(\"'\" & EpisodeList[[#This Row],[Show]] & \" Season Info'!C2:J15\"), 8,1)","v":"2006-07"}]
["30 Rock","Season 1",1,{"$f":"A50& \" S\" &C50","v":"30 Rock S1"},9,9,"\"The Baby Show\"","Michael Engler","Jack Burditt","2007-01-04",{"$f":"CHOOSE(WEEKDAY(J50),\"Sun\",\"Mon\",\"Tue\",\"Wed\",\"Thu\",\"Fri\",\"Sat\")","v":"Thu"},"21:30:00",109,5.9,49,"",{"$f":"VLOOKUP(EpisodeList[[#This Row],[Season Number]], INDIRECT(\"'\" & EpisodeList[[#This Row],[Show]] & \" Season Info'!C2:J15\"), 8,1)","v":"2006-07"}]
["The Office","Season 3",3,{"$f":"A51& \" S\" &C51","v":"The Office S3"},41,13,"\"Traveling Salesmen\"","Greg Daniels","Michael Schur & Lee Eisenberg & Gene Stupnitsky","2007-01-11",{"$f":"CHOOSE(WEEKDAY(J51),\"Sun\",\"Mon\",\"Tue\",\"Wed\",\"Thu\",\"Fri\",\"Sat\")","v":"Thu"},"20:30:00",3012,10.119999999999999,50,"",{"$f":"VLOOKUP(EpisodeList[[#This Row],[Season Number]], INDIRECT(\"'\" & EpisodeList[[#This Row],[Show]] & \" Season Info'!C2:J15\"), 8,1)","v":"2006-07"}]
["30 Rock","Season 1",1,{"$f":"A52& \" S\" &C52","v":"30 Rock S1"},10,10,"\"The Rural Juror\"","Beth McCarthy","Matt Hubbard","2007-01-11",{"$f":"CHOOSE(WEEKDAY(J52),\"Sun\",\"Mon\",\"Tue\",\"Wed\",\"Thu\",\"Fri\",\"Sat\")","v":"Thu"},"21:30:00",110,6.1,51,"",{"$f":"VLOOKUP(EpisodeList[[#This Row],[Season Number]], INDIRECT(\"'\" & EpisodeList[[#This Row],[Show]] & \" Season Info'!C2:J15\"), 8,1)","v":"2006-07"}]
["The Office","Season 3",3,{"$f":"A53& \" S\" &C53","v":"The Office S3"},42,14,"\"The Return\"","Greg Daniels","Lee Eisenberg & Gene Stupnitsky & Michael Schur","2007-01-18",{"$f":"CHOOSE(WEEKDAY(J53),\"Sun\",\"Mon\",\"Tue\",\"Wed\",\"Thu\",\"Fri\",\"Sat\")","v":"Thu"},"20:30:00",3013,10.199999999999999,52,"",{"$f":"VLOOKUP(EpisodeList[[#This Row],[Season Number]], INDIRECT(\"'\" & EpisodeList[[#This Row],[Show]] & \" Season Info'!C2:J15\"), 8,1)","v":"2006-07"}]
["30 Rock","Season 1",1,{"$f":"A54& \" S\" &C54","v":"30 Rock S1"},11,11,"\"The Head and the Hair\"","Gail Mancuso","Tina Fey & John Riggi","2007-01-18",{"$f":"CHOOSE(WEEKDAY(J54),\"Sun\",\"Mon\",\"Tue\",\"Wed\",\"Thu\",\"Fri\",\"Sat\")","v":"Thu"},"21:30:00",111,5,53,"",{"$f":"VLOOKUP(EpisodeList[[#This Row],[Season Number]], INDIRECT(\"'\" & EpisodeList[[#This Row],[Show]] & \" Season Info'!C2:J15\"), 8,1)","v":"2006-07"}]
["The Office","Season 3",3,{"$f":"A55& \" S\" &C55","v":"The Office S3"},43,15,"\"Ben Franklin\"","Randall Einhorn","Mindy Kaling","2007-02-01",{"$f":"CHOOSE(WEEKDAY(J55),\"Sun\",\"Mon\",\"Tue\",\"Wed\",\"Thu\",\"Fri\",\"Sat\")","v":"Thu"},"20:30:00",3015,10.11,54,"",{"$f":"VLOOKUP(EpisodeList[[#This Row],[Season Number]], INDIRECT(\"'\" & EpisodeList[[#This Row],[Show]] & \" Season Info'!C2:J15\"), 8,1)","v":"2006-07"}]
["30 Rock","Season 1",1,{"$f":"A56& \" S\" &C56","v":"30 Rock S1"},12,12,"\"Black Tie\"","Don Scardino","Kay Cannon & Tina Fey","2007-02-01",{"$f":"CHOOSE(WEEKDAY(J56),\"Sun\",\"Mon\",\"Tue\",\"Wed\",\"Thu\",\"Fri\",\"Sat\")","v":"Thu"},"21:30:00",112,5.7,55,"",{"$f":"VLOOKUP(EpisodeList[[#This Row],[Season Number]], INDIRECT(\"'\" & EpisodeList[[#This Row],[Show]] & \" Season Info'!C2:J15\"), 8,1)","v":"2006-07"}]
["The Office","Season 3",3,{"$f":"A57& \" S\" &C57","v":"The Office S3"},44,16,"\"Phyllis' Wedding\"","Ken Whittingham","Caroline Williams","2007-02-08",{"$f":"CHOOSE(WEEKDAY(J57),\"Sun\",\"Mon\",\"Tue\",\"Wed\",\"Thu\",\"Fri\",\"Sat\")","v":"Thu"},"20:30:00",3016,8.84,56,"",{"$f":"VLOOKUP(EpisodeList[[#This Row],[Season Number]], INDIRECT(\"'\" & EpisodeList[[#This Row],[Show]] & \" Season Info'!C2:J15\"), 8,1)","v":"2006-07"}]
["30 Rock","Season 1",1,{"$f":"A58& \" S\" &C58","v":"30 Rock S1"},13,13,"\"Up All Night\"","Michael Engler","Tina Fey","2007-02-08",{"$f":"CHOOSE(WEEKDAY(J58),\"Sun\",\"Mon\",\"Tue\",\"Wed\",\"Thu\",\"Fri\",\"Sat\")","v":"Thu"},"21:30:00",113,5.2,57,"",{"$f":"VLOOKUP(EpisodeList[[#This Row],[Season Number]], INDIRECT(\"'\" & EpisodeList[[#This Row],[Show]] & \" Season Info'!C2:J15\"), 8,1)","v":"2006-07"}]
["The Office","Season 3",3,{"$f":"A59& \" S\" &C59","v":"The Office S3"},45,17,"\"Business School\"","Joss Whedon","Brent Forrester","2007-02-15",{"$f":"CHOOSE(WEEKDAY(J59),\"Sun\",\"Mon\",\"Tue\",\"Wed\",\"Thu\",\"Fri\",\"Sat\")","v":"Thu"},"20:30:00",3017,8.84,58,"",{"$f":"VLOOKUP(EpisodeList[[#This Row],[Season Number]], INDIRECT(\"'\" & EpisodeList[[#This Row],[Show]] & \" Season Info'!C2:J15\"), 8,1)","v":"2006-07"}]
["30 Rock","Season 1",1,{"$f":"A60& \" S\" &C60","v":"30 Rock S1"},14,14,"\"The C Word\"","Adam Bernstein","Tina Fey","2007-02-15",{"$f":"CHOOSE(WEEKDAY(J60),\"Sun\",\"Mon\",\"Tue\",\"Wed\",\"Thu\",\"Fri\",\"Sat\")","v":"Thu"},"21:30:00",114,5,59,"",{"$f":"VLOOKUP(EpisodeList[[#This Row],[Season Number]], INDIRECT(\"'\" & EpisodeList[[#This Row],[Show]] & \" Season Info'!C2:J15\"), 8,1)","v":"2006-07"}]
["The Office","Season 3",3,{"$f":"A61& \" S\" &C61","v":"The Office S3"},46,18,"\"Cocktails\"","J. J. Abrams","Paul Lieberstein","2007-02-22",{"$f":"CHOOSE(WEEKDAY(J61),\"Sun\",\"Mon\",\"Tue\",\"Wed\",\"Thu\",\"Fri\",\"Sat\")","v":"Thu"},"20:30:00",3018,8.3000000000000007,60,"",{"$f":"VLOOKUP(EpisodeList[[#This Row],[Season Number]], INDIRECT(\"'\" & EpisodeList[[#This Row],[Show]] & \" Season Info'!C2:J15\"), 8,1)","v":"2006-07"}]
["30 Rock","Season 1",1,{"$f":"A62& \" S\" &C62","v":"30 Rock S1"},15,15,"\"Hard Ball\"","Don Scardino","Matt Hubbard","2007-02-22",{"$f":"CHOOSE(WEEKDAY(J62),\"Sun\",\"Mon\",\"Tue\",\"Wed\",\"Thu\",\"Fri\",\"Sat\")","v":"Thu"},"21:30:00",115,4.5999999999999996,61,"",{"$f":"VLOOKUP(EpisodeList[[#This Row],[Season Number]], INDIRECT(\"'\" & EpisodeList[[#This Row],[Show]] & \" Season Info'!C2:J15\"), 8,1)","v":"2006-07"}]
["30 Rock","Season 1",1,{"$f":"A63& \" S\" &C63","v":"30 Rock S1"},16,16,"\"The Source Awards\"","Don Scardino","Robert Carlock & Daisy Gardner","2007-03-01",{"$f":"CHOOSE(WEEKDAY(J63),\"Sun\",\"Mon\",\"Tue\",\"Wed\",\"Thu\",\"Fri\",\"Sat\")","v":"Thu"},"21:30:00",116,5.7,62,"",{"$f":"VLOOKUP(EpisodeList[[#This Row],[Season Number]], INDIRECT(\"'\" & EpisodeList[[#This Row],[Show]] & \" Season Info'!C2:J15\"), 8,1)","v":"2006-07"}]
["30 Rock","Season 1",1,{"$f":"A64& \" S\" &C64","v":"30 Rock S1"},17,17,"\"The Fighting Irish\"","Dennie Gordon","Jack Burditt","2007-03-08",{"$f":"CHOOSE(WEEKDAY(J64),\"Sun\",\"Mon\",\"Tue\",\"Wed\",\"Thu\",\"Fri\",\"Sat\")","v":"Thu"},"21:30:00",117,5.2,63,"",{"$f":"VLOOKUP(EpisodeList[[#This Row],[Season Number]], INDIRECT(\"'\" & EpisodeList[[#This Row],[Show]] & \" Season Info'!C2:J15\"), 8,1)","v":"2006-07"}]
["The Office","Season 3",3,{"$f":"A65& \" S\" &C65","v":"The Office S3"},47,19,"\"The Negotiation\"","Jeffrey Blitz","Michael Schur","2007-04-05",{"$f":"CHOOSE(WEEKDAY(J65),\"Sun\",\"Mon\",\"Tue\",\"Wed\",\"Thu\",\"Fri\",\"Sat\")","v":"Thu"},"20:30:00",3019,6.74,64,"",{"$f":"VLOOKUP(EpisodeList[[#This Row],[Season Number]], INDIRECT(\"'\" & EpisodeList[[#This Row],[Show]] & \" Season Info'!C2:J15\"), 8,1)","v":"2006-07"}]
["30 Rock","Season 1",1,{"$f":"A66& \" S\" &C66","v":"30 Rock S1"},18,18,"\"Fireworks\"","Beth McCarthy","Dave Finkel & Brett Baer","2007-04-05",{"$f":"CHOOSE(WEEKDAY(J66),\"Sun\",\"Mon\",\"Tue\",\"Wed\",\"Thu\",\"Fri\",\"Sat\")","v":"Thu"},"21:00:00",118,5.4,65,{"$f":"IF(AND(\n    COUNTIFS(A:A, A66, J:J, J66) = 1,\n    COUNTIFS(A:A, \"30 Rock\", J:J, J66) = 1,\n    COUNTIFS(A:A, \"The Office\", J:J, J66) = 1,\n    COUNTIFS(A:A, \"Community\", J:J, J66) = 1,\n    COUNTIFS(A:A, \"Parks and Rec\", J:J, J66) = 1\n), \"Yes\", \"\")","v":""},{"$f":"VLOOKUP(EpisodeList[[#This Row],[Season Number]], INDIRECT(\"'\" & EpisodeList[[#This Row],[Show]] & \" Season Info'!C2:J15\"), 8,1)","v":"2006-07"}]
["The Office","Season 3",3,{"$f":"A67& \" S\" &C67","v":"The Office S3"},48,20,"\"Safety Training\"","Harold Ramis","B. J. Novak","2007-04-12",{"$f":"CHOOSE(WEEKDAY(J67),\"Sun\",\"Mon\",\"Tue\",\"Wed\",\"Thu\",\"Fri\",\"Sat\")","v":"Thu"},"20:30:00",3020,7.71,66,"",{"$f":"VLOOKUP(EpisodeList[[#This Row],[Season Number]], INDIRECT(\"'\" & EpisodeList[[#This Row],[Show]] & \" Season Info'!C2:J15\"), 8,1)","v":"2006-07"}]
["30 Rock","Season 1",1,{"$f":"A68& \" S\" &C68","v":"30 Rock S1"},19,19,"\"Corporate Crush\"","Don Scardino","John Riggi","2007-04-12",{"$f":"CHOOSE(WEEKDAY(J68),\"Sun\",\"Mon\",\"Tue\",\"Wed\",\"Thu\",\"Fri\",\"Sat\")","v":"Thu"},"21:00:00",119,5.0999999999999996,67,"",{"$f":"VLOOKUP(EpisodeList[[#This Row],[Season Number]], INDIRECT(\"'\" & EpisodeList[[#This Row],[Show]] & \" Season Info'!C2:J15\"), 8,1)","v":"2006-07"}]
["30 Rock","Season 1",1,{"$f":"A69& \" S\" &C69","v":"30 Rock S1"},20,20,"\"Cleveland\"","Paul Feig","Jack Burditt & Robert Carlock","2007-04-19",{"$f":"CHOOSE(WEEKDAY(J69),\"Sun\",\"Mon\",\"Tue\",\"Wed\",\"Thu\",\"Fri\",\"Sat\")","v":"Thu"},"21:00:00",120,5.2,68,"",{"$f":"VLOOKUP(EpisodeList[[#This Row],[Season Number]], INDIRECT(\"'\" & EpisodeList[[#This Row],[Show]] & \" Season Info'!C2:J15\"), 8,1)","v":"2006-07"}]
["The Office","Season 3",3,{"$f":"A70& \" S\" &C70","v":"The Office S3"},49,21,"\"Product Recall\"","Randall Einhorn","Justin Spitzer & Brent Forrester","2007-04-26",{"$f":"CHOOSE(WEEKDAY(J70),\"Sun\",\"Mon\",\"Tue\",\"Wed\",\"Thu\",\"Fri\",\"Sat\")","v":"Thu"},"20:30:00",3025,7.56,69,"",{"$f":"VLOOKUP(EpisodeList[[#This Row],[Season Number]], INDIRECT(\"'\" & EpisodeList[[#This Row],[Show]] & \" Season Info'!C2:J15\"), 8,1)","v":"2006-07"}]
["30 Rock","Season 1",1,{"$f":"A71& \" S\" &C71","v":"30 Rock S1"},21,21,"\"Hiatus\"","Don Scardino","Tina Fey","2007-04-26",{"$f":"CHOOSE(WEEKDAY(J71),\"Sun\",\"Mon\",\"Tue\",\"Wed\",\"Thu\",\"Fri\",\"Sat\")","v":"Thu"},"21:00:00",121,4.7,70,"",{"$f":"VLOOKUP(EpisodeList[[#This Row],[Season Number]], INDIRECT(\"'\" & EpisodeList[[#This Row],[Show]] & \" Season Info'!C2:J15\"), 8,1)","v":"2006-07"}]
["The Office","Season 3",3,{"$f":"A72& \" S\" &C72","v":"The Office S3"},50,22,"\"Women's Appreciation\"","Tucker Gates","Gene Stupnitsky & Lee Eisenberg","2007-05-03",{"$f":"CHOOSE(WEEKDAY(J72),\"Sun\",\"Mon\",\"Tue\",\"Wed\",\"Thu\",\"Fri\",\"Sat\")","v":"Thu"},"20:30:00",3021,7,71,"",{"$f":"VLOOKUP(EpisodeList[[#This Row],[Season Number]], INDIRECT(\"'\" & EpisodeList[[#This Row],[Show]] & \" Season Info'!C2:J15\"), 8,1)","v":"2006-07"}]
["The Office","Season 3",3,{"$f":"A73& \" S\" &C73","v":"The Office S3"},51,23,"\"Beach Games\"","Harold Ramis","Jennifer Celotta & Greg Daniels","2007-05-10",{"$f":"CHOOSE(WEEKDAY(J73),\"Sun\",\"Mon\",\"Tue\",\"Wed\",\"Thu\",\"Fri\",\"Sat\")","v":"Thu"},"20:30:00",3022,7.2,72,"",{"$f":"VLOOKUP(EpisodeList[[#This Row],[Season Number]], INDIRECT(\"'\" & EpisodeList[[#This Row],[Show]] & \" Season Info'!C2:J15\"), 8,1)","v":"2006-07"}]
["The Office","Season 3",3,{"$f":"A74& \" S\" &C74","v":"The Office S3"},52,24,"\"The Job\"","Ken Kwapis","Paul Lieberstein & Michael Schur","2007-05-17",{"$f":"CHOOSE(WEEKDAY(J74),\"Sun\",\"Mon\",\"Tue\",\"Wed\",\"Thu\",\"Fri\",\"Sat\")","v":"Thu"},"20:30:00",3023,7.88,73,"",{"$f":"VLOOKUP(EpisodeList[[#This Row],[Season Number]], INDIRECT(\"'\" & EpisodeList[[#This Row],[Show]] & \" Season Info'!C2:J15\"), 8,1)","v":"2006-07"}]
["The Office","Season 3",3,{"$f":"A75& \" S\" &C75","v":"The Office S3"},53,25,"\"The Job\"","Ken Kwapis","Paul Lieberstein & Michael Schur","2007-05-17",{"$f":"CHOOSE(WEEKDAY(J75),\"Sun\",\"Mon\",\"Tue\",\"Wed\",\"Thu\",\"Fri\",\"Sat\")","v":"Thu"},"21:00:00",3024,7.88,74,"",{"$f":"VLOOKUP(EpisodeList[[#This Row],[Season Number]], INDIRECT(\"'\" & EpisodeList[[#This Row],[Show]] & \" Season Info'!C2:J15\"), 8,1)","v":"2006-07"}]
["The Office","Season 4",4,{"$f":"A76& \" S\" &C76","v":"The Office S4"},54,1,"\"Fun Run\"","Greg Daniels","Greg Daniels","2007-09-27",{"$f":"CHOOSE(WEEKDAY(J76),\"Sun\",\"Mon\",\"Tue\",\"Wed\",\"Thu\",\"Fri\",\"Sat\")","v":"Thu"},"21:00:00",4001,9.6999999999999993,75,"",{"$f":"VLOOKUP(EpisodeList[[#This Row],[Season Number]], INDIRECT(\"'\" & EpisodeList[[#This Row],[Show]] & \" Season Info'!C2:J15\"), 8,1)","v":"2007-08"}]
["The Office","Season 4",4,{"$f":"A77& \" S\" &C77","v":"The Office S4"},55,2,"\"Fun Run\"","Greg Daniels","Greg Daniels","2007-09-27",{"$f":"CHOOSE(WEEKDAY(J77),\"Sun\",\"Mon\",\"Tue\",\"Wed\",\"Thu\",\"Fri\",\"Sat\")","v":"Thu"},"21:30:00",4002,9.6999999999999993,76,"",{"$f":"VLOOKUP(EpisodeList[[#This Row],[Season Number]], INDIRECT(\"'\" & EpisodeList[[#This Row],[Show]] & \" Season Info'!C2:J15\"), 8,1)","v":"2007-08"}]
["30 Rock","Season 2",2,{"$f":"A78& \" S\" &C78","v":"30 Rock S2"},22,1,"\"SeinfeldVision\"","Don Scardino","Tina Fey","2007-10-04",{"$f":"CHOOSE(WEEKDAY(J78),\"Sun\",\"Mon\",\"Tue\",\"Wed\",\"Thu\",\"Fri\",\"Sat\")","v":"Thu"},"20:30:00",201,7.3,77,"",{"$f":"VLOOKUP(EpisodeList[[#This Row],[Season Number]], INDIRECT(\"'\" & EpisodeList[[#This Row],[Show]] & \" Season Info'!C2:J15\"), 8,1)","v":"2007-08"}]
["The Office","Season 4",4,{"$f":"A79& \" S\" &C79","v":"The Office S4"},56,3,"\"Dunder Mifflin Infinity\"","Craig Zisk","Michael Schur","2007-10-04",{"$f":"CHOOSE(WEEKDAY(J79),\"Sun\",\"Mon\",\"Tue\",\"Wed\",\"Thu\",\"Fri\",\"Sat\")","v":"Thu"},"21:00:00",4003,8.49,78,"",{"$f":"VLOOKUP(EpisodeList[[#This Row],[Season Number]], INDIRECT(\"'\" & EpisodeList[[#This Row],[Show]] & \" Season Info'!C2:J15\"), 8,1)","v":"2007-08"}]
["The Office","Season 4",4,{"$f":"A80& \" S\" &C80","v":"The Office S4"},57,4,"\"Dunder Mifflin Infinity\"","Craig Zisk","Michael Schur","2007-10-04",{"$f":"CHOOSE(WEEKDAY(J80),\"Sun\",\"Mon\",\"Tue\",\"Wed\",\"Thu\",\"Fri\",\"Sat\")","v":"Thu"},"21:30:00",4004,8.49,79,"",{"$f":"VLOOKUP(EpisodeList[[#This Row],[Season Number]], INDIRECT(\"'\" & EpisodeList[[#This Row],[Show]] & \" Season Info'!C2:J15\"), 8,1)","v":"2007-08"}]
["30 Rock","Season 2",2,{"$f":"A81& \" S\" &C81","v":"30 Rock S2"},23,2,"\"Jack Gets in the Game\"","Michael Engler","Robert Carlock","2007-10-11",{"$f":"CHOOSE(WEEKDAY(J81),\"Sun\",\"Mon\",\"Tue\",\"Wed\",\"Thu\",\"Fri\",\"Sat\")","v":"Thu"},"20:30:00",202,6.6,80,"",{"$f":"VLOOKUP(EpisodeList[[#This Row],[Season Number]], INDIRECT(\"'\" & EpisodeList[[#This Row],[Show]] & \" Season Info'!C2:J15\"), 8,1)","v":"2007-08"}]
["The Office","Season 4",4,{"$f":"A82& \" S\" &C82","v":"The Office S4"},58,5,"\"Launch Party\"","Ken Whittingham","Jennifer Celotta","2007-10-11",{"$f":"CHOOSE(WEEKDAY(J82),\"Sun\",\"Mon\",\"Tue\",\"Wed\",\"Thu\",\"Fri\",\"Sat\")","v":"Thu"},"21:00:00",4005,8.91,81,"",{"$f":"VLOOKUP(EpisodeList[[#This Row],[Season Number]], INDIRECT(\"'\" & EpisodeList[[#This Row],[Show]] & \" Season Info'!C2:J15\"), 8,1)","v":"2007-08"}]
["The Office","Season 4",4,{"$f":"A83& \" S\" &C83","v":"The Office S4"},59,6,"\"Launch Party\"","Ken Whittingham","Jennifer Celotta","2007-10-11",{"$f":"CHOOSE(WEEKDAY(J83),\"Sun\",\"Mon\",\"Tue\",\"Wed\",\"Thu\",\"Fri\",\"Sat\")","v":"Thu"},"21:30:00",4006,8.91,82,"",{"$f":"VLOOKUP(EpisodeList[[#This Row],[Season Number]], INDIRECT(\"'\" & EpisodeList[[#This Row],[Show]] & \" Season Info'!C2:J15\"), 8,1)","v":"2007-08"}]
["30 Rock","Season 2",2,{"$f":"A84& \" S\" &C84","v":"30 Rock S2"},24,3,"\"The Collection\"","Don Scardino","Matt Hubbard","2007-10-18",{"$f":"CHOOSE(WEEKDAY(J84),\"Sun\",\"Mon\",\"Tue\",\"Wed\",\"Thu\",\"Fri\",\"Sat\")","v":"Thu"},"20:30:00",203,6.2,83,"",{"$f":"VLOOKUP(EpisodeList[[#This Row],[Season Number]], INDIRECT(\"'\" & EpisodeList[[#This Row],[Show]] & \" Season Info'!C2:J15\"), 8,1)","v":"2007-08"}]
["The Office","Season 4",4,{"$f":"A85& \" S\" &C85","v":"The Office S4"},60,7,"\"Money\"","Paul Lieberstein","Paul Lieberstein","2007-10-18",{"$f":"CHOOSE(WEEKDAY(J85),\"Sun\",\"Mon\",\"Tue\",\"Wed\",\"Thu\",\"Fri\",\"Sat\")","v":"Thu"},"21:00:00",4007,8.5,84,"",{"$f":"VLOOKUP(EpisodeList[[#This Row],[Season Number]], INDIRECT(\"'\" & EpisodeList[[#This Row],[Show]] & \" Season Info'!C2:J15\"), 8,1)","v":"2007-08"}]
["The Office","Season 4",4,{"$f":"A86& \" S\" &C86","v":"The Office S4"},61,8,"\"Money\"","Paul Lieberstein","Paul Lieberstein","2007-10-18",{"$f":"CHOOSE(WEEKDAY(J86),\"Sun\",\"Mon\",\"Tue\",\"Wed\",\"Thu\",\"Fri\",\"Sat\")","v":"Thu"},"21:30:00",4008,8.5,85,"",{"$f":"VLOOKUP(EpisodeList[[#This Row],[Season Number]], INDIRECT(\"'\" & EpisodeList[[#This Row],[Show]] & \" Season Info'!C2:J15\"), 8,1)","v":"2007-08"}]
["30 Rock","Season 2",2,{"$f":"A87& \" S\" &C87","v":"30 Rock S2"},25,4,"\"Rosemary's Baby\"","Michael Engler","Jack Burditt","2007-10-25",{"$f":"CHOOSE(WEEKDAY(J87),\"Sun\",\"Mon\",\"Tue\",\"Wed\",\"Thu\",\"Fri\",\"Sat\")","v":"Thu"},"20:30:00",204,6.5,86,"",{"$f":"VLOOKUP(EpisodeList[[#This Row],[Season Number]], INDIRECT(\"'\" & EpisodeList[[#This Row],[Show]] & \" Season Info'!C2:J15\"), 8,1)","v":"2007-08"}]
["The Office","Season 4",4,{"$f":"A88& \" S\" &C88","v":"The Office S4"},62,9,"\"Local Ad\"","Jason Reitman","B. J. Novak","2007-10-25",{"$f":"CHOOSE(WEEKDAY(J88),\"Sun\",\"Mon\",\"Tue\",\"Wed\",\"Thu\",\"Fri\",\"Sat\")","v":"Thu"},"21:00:00",4009,8.98,87,"",{"$f":"VLOOKUP(EpisodeList[[#This Row],[Season Number]], INDIRECT(\"'\" & EpisodeList[[#This Row],[Show]] & \" Season Info'!C2:J15\"), 8,1)","v":"2007-08"}]
["The Office","Season 4",4,{"$f":"A89& \" S\" &C89","v":"The Office S4"},63,10,"\"Branch Wars\"","Joss Whedon","Mindy Kaling","2007-11-01",{"$f":"CHOOSE(WEEKDAY(J89),\"Sun\",\"Mon\",\"Tue\",\"Wed\",\"Thu\",\"Fri\",\"Sat\")","v":"Thu"},"21:00:00",4010,8.39,88,"",{"$f":"VLOOKUP(EpisodeList[[#This Row],[Season Number]], INDIRECT(\"'\" & EpisodeList[[#This Row],[Show]] & \" Season Info'!C2:J15\"), 8,1)","v":"2007-08"}]
["30 Rock","Season 2",2,{"$f":"A90& \" S\" &C90","v":"30 Rock S2"},26,5,"\"Greenzo\"","Don Scardino","Jon Pollack","2007-11-08",{"$f":"CHOOSE(WEEKDAY(J90),\"Sun\",\"Mon\",\"Tue\",\"Wed\",\"Thu\",\"Fri\",\"Sat\")","v":"Thu"},"20:30:00",205,6.6,89,"",{"$f":"VLOOKUP(EpisodeList[[#This Row],[Season Number]], INDIRECT(\"'\" & EpisodeList[[#This Row],[Show]] & \" Season Info'!C2:J15\"), 8,1)","v":"2007-08"}]
["The Office","Season 4",4,{"$f":"A91& \" S\" &C91","v":"The Office S4"},64,11,"\"Survivor Man\"","Paul Feig","Steve Carell","2007-11-08",{"$f":"CHOOSE(WEEKDAY(J91),\"Sun\",\"Mon\",\"Tue\",\"Wed\",\"Thu\",\"Fri\",\"Sat\")","v":"Thu"},"21:00:00",4011,8.2899999999999991,90,"",{"$f":"VLOOKUP(EpisodeList[[#This Row],[Season Number]], INDIRECT(\"'\" & EpisodeList[[#This Row],[Show]] & \" Season Info'!C2:J15\"), 8,1)","v":"2007-08"}]
["30 Rock","Season 2",2,{"$f":"A92& \" S\" &C92","v":"30 Rock S2"},27,6,"\"Somebody to Love\"","Beth McCarthy","Tina Fey & Kay Cannon","2007-11-15",{"$f":"CHOOSE(WEEKDAY(J92),\"Sun\",\"Mon\",\"Tue\",\"Wed\",\"Thu\",\"Fri\",\"Sat\")","v":"Thu"},"20:30:00",206,5.8,91,"",{"$f":"VLOOKUP(EpisodeList[[#This Row],[Season Number]], INDIRECT(\"'\" & EpisodeList[[#This Row],[Show]] & \" Season Info'!C2:J15\"), 8,1)","v":"2007-08"}]
["The Office","Season 4",4,{"$f":"A93& \" S\" &C93","v":"The Office S4"},65,12,"\"The Deposition\"","Julian Farino","Lester Lewis","2007-11-15",{"$f":"CHOOSE(WEEKDAY(J93),\"Sun\",\"Mon\",\"Tue\",\"Wed\",\"Thu\",\"Fri\",\"Sat\")","v":"Thu"},"21:00:00",4012,8.86,92,"",{"$f":"VLOOKUP(EpisodeList[[#This Row],[Season Number]], INDIRECT(\"'\" & EpisodeList[[#This Row],[Show]] & \" Season Info'!C2:J15\"), 8,1)","v":"2007-08"}]
["30 Rock","Season 2",2,{"$f":"A94& \" S\" &C94","v":"30 Rock S2"},28,7,"\"Cougars\"","Michael Engler","John Riggi","2007-11-29",{"$f":"CHOOSE(WEEKDAY(J94),\"Sun\",\"Mon\",\"Tue\",\"Wed\",\"Thu\",\"Fri\",\"Sat\")","v":"Thu"},"20:30:00",207,6.4,93,"",{"$f":"VLOOKUP(EpisodeList[[#This Row],[Season Number]], INDIRECT(\"'\" & EpisodeList[[#This Row],[Show]] & \" Season Info'!C2:J15\"), 8,1)","v":"2007-08"}]
["30 Rock","Season 2",2,{"$f":"A95& \" S\" &C95","v":"30 Rock S2"},29,8,"\"Secrets and Lies\"","Michael Engler","Ron Weiner","2007-12-06",{"$f":"CHOOSE(WEEKDAY(J95),\"Sun\",\"Mon\",\"Tue\",\"Wed\",\"Thu\",\"Fri\",\"Sat\")","v":"Thu"},"20:30:00",208,5.8,94,"",{"$f":"VLOOKUP(EpisodeList[[#This Row],[Season Number]], INDIRECT(\"'\" & EpisodeList[[#This Row],[Show]] & \" Season Info'!C2:J15\"), 8,1)","v":"2007-08"}]
["30 Rock","Season 2",2,{"$f":"A96& \" S\" &C96","v":"30 Rock S2"},30,9,"\"Ludachristmas\"","Don Scardino","Tami Sagher","2007-12-13",{"$f":"CHOOSE(WEEKDAY(J96),\"Sun\",\"Mon\",\"Tue\",\"Wed\",\"Thu\",\"Fri\",\"Sat\")","v":"Thu"},"21:00:00",209,5.6,95,"",{"$f":"VLOOKUP(EpisodeList[[#This Row],[Season Number]], INDIRECT(\"'\" & EpisodeList[[#This Row],[Show]] & \" Season Info'!C2:J15\"), 8,1)","v":"2007-08"}]
["30 Rock","Season 2",2,{"$f":"A97& \" S\" &C97","v":"30 Rock S2"},31,10,"Episode 210","Richard Shepard","Robert Carlock & Donald Glover","2008-01-10",{"$f":"CHOOSE(WEEKDAY(J97),\"Sun\",\"Mon\",\"Tue\",\"Wed\",\"Thu\",\"Fri\",\"Sat\")","v":"Thu"},"20:30:00",210,6,96,"",{"$f":"VLOOKUP(EpisodeList[[#This Row],[Season Number]], INDIRECT(\"'\" & EpisodeList[[#This Row],[Show]] & \" Season Info'!C2:J15\"), 8,1)","v":"2007-08"}]
["30 Rock","Season 2",2,{"$f":"A98& \" S\" &C98","v":"30 Rock S2"},32,11,"\"MILF Island\"","Kevin Rodney Sullivan","Tina Fey & Matt Hubbard","2008-04-10",{"$f":"CHOOSE(WEEKDAY(J98),\"Sun\",\"Mon\",\"Tue\",\"Wed\",\"Thu\",\"Fri\",\"Sat\")","v":"Thu"},"20:30:00",212,5.7,97,"",{"$f":"VLOOKUP(EpisodeList[[#This Row],[Season Number]], INDIRECT(\"'\" & EpisodeList[[#This Row],[Show]] & \" Season Info'!C2:J15\"), 8,1)","v":"2007-08"}]
["The Office","Season 4",4,{"$f":"A99& \" S\" &C99","v":"The Office S4"},66,13,"\"Dinner Party\"","Paul Feig","Gene Stupnitsky & Lee Eisenberg","2008-04-10",{"$f":"CHOOSE(WEEKDAY(J99),\"Sun\",\"Mon\",\"Tue\",\"Wed\",\"Thu\",\"Fri\",\"Sat\")","v":"Thu"},"21:00:00",4013,9.2200000000000006,98,"",{"$f":"VLOOKUP(EpisodeList[[#This Row],[Season Number]], INDIRECT(\"'\" & EpisodeList[[#This Row],[Show]] & \" Season Info'!C2:J15\"), 8,1)","v":"2007-08"}]
["30 Rock","Season 2",2,{"$f":"A100& \" S\" &C100","v":"30 Rock S2"},33,12,"\"Subway Hero\"","Don Scardino","Jack Burditt & Robert Carlock","2008-04-17",{"$f":"CHOOSE(WEEKDAY(J100),\"Sun\",\"Mon\",\"Tue\",\"Wed\",\"Thu\",\"Fri\",\"Sat\")","v":"Thu"},"20:30:00",211,6.4,99,"",{"$f":"VLOOKUP(EpisodeList[[#This Row],[Season Number]], INDIRECT(\"'\" & EpisodeList[[#This Row],[Show]] & \" Season Info'!C2:J15\"), 8,1)","v":"2007-08"}]
["The Office","Season 4",4,{"$f":"A101& \" S\" &C101","v":"The Office S4"},67,14,"\"Chair Model\"","Jeffrey Blitz","B. J. Novak","2008-04-17",{"$f":"CHOOSE(WEEKDAY(J101),\"Sun\",\"Mon\",\"Tue\",\"Wed\",\"Thu\",\"Fri\",\"Sat\")","v":"Thu"},"21:00:00",4014,9.81,100,"",{"$f":"VLOOKUP(EpisodeList[[#This Row],[Season Number]], INDIRECT(\"'\" & EpisodeList[[#This Row],[Show]] & \" Season Info'!C2:J15\"), 8,1)","v":"2007-08"}]
["The Office","Season 4",4,{"$f":"A102& \" S\" &C102","v":"The Office S4"},68,15,"\"Night Out\"","Ken Whittingham","Mindy Kaling","2008-04-24",{"$f":"CHOOSE(WEEKDAY(J102),\"Sun\",\"Mon\",\"Tue\",\"Wed\",\"Thu\",\"Fri\",\"Sat\")","v":"Thu"},"21:00:00",4015,7.56,101,"",{"$f":"VLOOKUP(EpisodeList[[#This Row],[Season Number]], INDIRECT(\"'\" & EpisodeList[[#This Row],[Show]] & \" Season Info'!C2:J15\"), 8,1)","v":"2007-08"}]
["30 Rock","Season 2",2,{"$f":"A103& \" S\" &C103","v":"30 Rock S2"},34,13,"\"Succession\"","Gail Mancuso","Andrew Guest & John Riggi","2008-04-24",{"$f":"CHOOSE(WEEKDAY(J103),\"Sun\",\"Mon\",\"Tue\",\"Wed\",\"Thu\",\"Fri\",\"Sat\")","v":"Thu"},"21:30:00",213,5.5,102,"",{"$f":"VLOOKUP(EpisodeList[[#This Row],[Season Number]], INDIRECT(\"'\" & EpisodeList[[#This Row],[Show]] & \" Season Info'!C2:J15\"), 8,1)","v":"2007-08"}]
["The Office","Season 4",4,{"$f":"A104& \" S\" &C104","v":"The Office S4"},69,16,"\"Did I Stutter?\"","Randall Einhorn","Brent Forrester & Justin Spitzer","2008-05-01",{"$f":"CHOOSE(WEEKDAY(J104),\"Sun\",\"Mon\",\"Tue\",\"Wed\",\"Thu\",\"Fri\",\"Sat\")","v":"Thu"},"21:00:00",4016,7.67,103,"",{"$f":"VLOOKUP(EpisodeList[[#This Row],[Season Number]], INDIRECT(\"'\" & EpisodeList[[#This Row],[Show]] & \" Season Info'!C2:J15\"), 8,1)","v":"2007-08"}]
["30 Rock","Season 2",2,{"$f":"A105& \" S\" &C105","v":"30 Rock S2"},35,14,"\"Sandwich Day\"","Don Scardino","Robert Carlock & Jack Burditt","2008-05-01",{"$f":"CHOOSE(WEEKDAY(J105),\"Sun\",\"Mon\",\"Tue\",\"Wed\",\"Thu\",\"Fri\",\"Sat\")","v":"Thu"},"21:30:00",214,5.4,104,"",{"$f":"VLOOKUP(EpisodeList[[#This Row],[Season Number]], INDIRECT(\"'\" & EpisodeList[[#This Row],[Show]] & \" Season Info'!C2:J15\"), 8,1)","v":"2007-08"}]
["The Office","Season 4",4,{"$f":"A106& \" S\" &C106","v":"The Office S4"},70,17,"\"Job Fair\"","Tucker Gates","Lee Eisenberg & Gene Stupnitsky","2008-05-08",{"$f":"CHOOSE(WEEKDAY(J106),\"Sun\",\"Mon\",\"Tue\",\"Wed\",\"Thu\",\"Fri\",\"Sat\")","v":"Thu"},"21:00:00",4017,7.22,105,"",{"$f":"VLOOKUP(EpisodeList[[#This Row],[Season Number]], INDIRECT(\"'\" & EpisodeList[[#This Row],[Show]] & \" Season Info'!C2:J15\"), 8,1)","v":"2007-08"}]
["30 Rock","Season 2",2,{"$f":"A107& \" S\" &C107","v":"30 Rock S2"},36,15,"\"Cooter\"","Don Scardino","Tina Fey","2008-05-08",{"$f":"CHOOSE(WEEKDAY(J107),\"Sun\",\"Mon\",\"Tue\",\"Wed\",\"Thu\",\"Fri\",\"Sat\")","v":"Thu"},"21:30:00",215,5.6,106,"",{"$f":"VLOOKUP(EpisodeList[[#This Row],[Season Number]], INDIRECT(\"'\" & EpisodeList[[#This Row],[Show]] & \" Season Info'!C2:J15\"), 8,1)","v":"2007-08"}]
["The Office","Season 4",4,{"$f":"A108& \" S\" &C108","v":"The Office S4"},71,18,"\"Goodbye, Toby\"","Paul Feig","Jennifer Celotta & Paul Lieberstein","2008-05-15",{"$f":"CHOOSE(WEEKDAY(J108),\"Sun\",\"Mon\",\"Tue\",\"Wed\",\"Thu\",\"Fri\",\"Sat\")","v":"Thu"},"21:00:00",4018,8.07,107,"",{"$f":"VLOOKUP(EpisodeList[[#This Row],[Season Number]], INDIRECT(\"'\" & EpisodeList[[#This Row],[Show]] & \" Season Info'!C2:J15\"), 8,1)","v":"2007-08"}]
["The Office","Season 4",4,{"$f":"A109& \" S\" &C109","v":"The Office S4"},72,19,"\"Goodbye, Toby\"","Paul Feig","Jennifer Celotta & Paul Lieberstein","2008-05-15",{"$f":"CHOOSE(WEEKDAY(J109),\"Sun\",\"Mon\",\"Tue\",\"Wed\",\"Thu\",\"Fri\",\"Sat\")","v":"Thu"},"21:30:00",4019,8.07,108,"",{"$f":"VLOOKUP(EpisodeList[[#This Row],[Season Number]], INDIRECT(\"'\" & EpisodeList[[#This Row],[Show]] & \" Season Info'!C2:J15\"), 8,1)","v":"2007-08"}]
["The Office","Season 5",5,{"$f":"A110& \" S\" &C110","v":"The Office S5"},73,1,"\"Weight Loss\"","Paul Feig","Lee Eisenberg & Gene Stupnitsky","2008-09-25",{"$f":"CHOOSE(WEEKDAY(J110),\"Sun\",\"Mon\",\"Tue\",\"Wed\",\"Thu\",\"Fri\",\"Sat\")","v":"Thu"},"21:00:00",5001,9.1999999999999993,109,"",{"$f":"VLOOKUP(EpisodeList[[#This Row],[Season Number]], INDIRECT(\"'\" & EpisodeList[[#This Row],[Show]] & \" Season Info'!C2:J15\"), 8,1)","v":"2008-09"}]
["The Office","Season 5",5,{"$f":"A111& \" S\" &C111","v":"The Office S5"},74,2,"\"Weight Loss\"","Paul Feig","Lee Eisenberg & Gene Stupnitsky","2008-09-25",{"$f":"CHOOSE(WEEKDAY(J111),\"Sun\",\"Mon\",\"Tue\",\"Wed\",\"Thu\",\"Fri\",\"Sat\")","v":"Thu"},"21:30:00",5002,9.1999999999999993,110,"",{"$f":"VLOOKUP(EpisodeList[[#This Row],[Season Number]], INDIRECT(\"'\" & EpisodeList[[#This Row],[Show]] & \" Season Info'!C2:J15\"), 8,1)","v":"2008-09"}]
["The Office","Season 5",5,{"$f":"A112& \" S\" &C112","v":"The Office S5"},75,3,"\"Business Ethics\"","Jeffrey Blitz","Ryan Koh","2008-10-09",{"$f":"CHOOSE(WEEKDAY(J112),\"Sun\",\"Mon\",\"Tue\",\"Wed\",\"Thu\",\"Fri\",\"Sat\")","v":"Thu"},"21:00:00",5003,8.99,111,"",{"$f":"VLOOKUP(EpisodeList[[#This Row],[Season Number]], INDIRECT(\"'\" & EpisodeList[[#This Row],[Show]] & \" Season Info'!C2:J15\"), 8,1)","v":"2008-09"}]
["The Office","Season 5",5,{"$f":"A113& \" S\" &C113","v":"The Office S5"},76,4,"\"Baby Shower\"","Greg Daniels","Aaron Shure","2008-10-16",{"$f":"CHOOSE(WEEKDAY(J113),\"Sun\",\"Mon\",\"Tue\",\"Wed\",\"Thu\",\"Fri\",\"Sat\")","v":"Thu"},"21:00:00",5004,8.07,112,"",{"$f":"VLOOKUP(EpisodeList[[#This Row],[Season Number]], INDIRECT(\"'\" & EpisodeList[[#This Row],[Show]] & \" Season Info'!C2:J15\"), 8,1)","v":"2008-09"}]
["The Office","Season 5",5,{"$f":"A114& \" S\" &C114","v":"The Office S5"},77,5,"\"Crime Aid\"","Jennifer Celotta","Charlie Grandy","2008-10-23",{"$f":"CHOOSE(WEEKDAY(J114),\"Sun\",\"Mon\",\"Tue\",\"Wed\",\"Thu\",\"Fri\",\"Sat\")","v":"Thu"},"21:00:00",5005,7.74,113,"",{"$f":"VLOOKUP(EpisodeList[[#This Row],[Season Number]], INDIRECT(\"'\" & EpisodeList[[#This Row],[Show]] & \" Season Info'!C2:J15\"), 8,1)","v":"2008-09"}]
["The Office","Season 5",5,{"$f":"A115& \" S\" &C115","v":"The Office S5"},78,6,"\"Employee Transfer\"","David Rogers","Anthony Q. Farrell","2008-10-30",{"$f":"CHOOSE(WEEKDAY(J115),\"Sun\",\"Mon\",\"Tue\",\"Wed\",\"Thu\",\"Fri\",\"Sat\")","v":"Thu"},"21:00:00",5006,9.32,114,"",{"$f":"VLOOKUP(EpisodeList[[#This Row],[Season Number]], INDIRECT(\"'\" & EpisodeList[[#This Row],[Show]] & \" Season Info'!C2:J15\"), 8,1)","v":"2008-09"}]
["30 Rock","Season 3",3,{"$f":"A116& \" S\" &C116","v":"30 Rock S3"},37,1,"\"Do-Over\"","Don Scardino","Tina Fey","2008-10-30",{"$f":"CHOOSE(WEEKDAY(J116),\"Sun\",\"Mon\",\"Tue\",\"Wed\",\"Thu\",\"Fri\",\"Sat\")","v":"Thu"},"21:30:00",301,8.6999999999999993,115,"",{"$f":"VLOOKUP(EpisodeList[[#This Row],[Season Number]], INDIRECT(\"'\" & EpisodeList[[#This Row],[Show]] & \" Season Info'!C2:J15\"), 8,1)","v":"2008-09"}]
["The Office","Season 5",5,{"$f":"A117& \" S\" &C117","v":"The Office S5"},79,7,"\"Customer Survey\"","Stephen Merchant","Lester Lewis","2008-11-06",{"$f":"CHOOSE(WEEKDAY(J117),\"Sun\",\"Mon\",\"Tue\",\"Wed\",\"Thu\",\"Fri\",\"Sat\")","v":"Thu"},"21:00:00",5007,8.35,116,"",{"$f":"VLOOKUP(EpisodeList[[#This Row],[Season Number]], INDIRECT(\"'\" & EpisodeList[[#This Row],[Show]] & \" Season Info'!C2:J15\"), 8,1)","v":"2008-09"}]
["30 Rock","Season 3",3,{"$f":"A118& \" S\" &C118","v":"30 Rock S3"},38,2,"\"Believe in the Stars\"","Don Scardino","Robert Carlock","2008-11-06",{"$f":"CHOOSE(WEEKDAY(J118),\"Sun\",\"Mon\",\"Tue\",\"Wed\",\"Thu\",\"Fri\",\"Sat\")","v":"Thu"},"21:30:00",302,8,117,"",{"$f":"VLOOKUP(EpisodeList[[#This Row],[Season Number]], INDIRECT(\"'\" & EpisodeList[[#This Row],[Show]] & \" Season Info'!C2:J15\"), 8,1)","v":"2008-09"}]
["The Office","Season 5",5,{"$f":"A119& \" S\" &C119","v":"The Office S5"},80,8,"\"Business Trip\"","Randall Einhorn","Brent Forrester","2008-11-13",{"$f":"CHOOSE(WEEKDAY(J119),\"Sun\",\"Mon\",\"Tue\",\"Wed\",\"Thu\",\"Fri\",\"Sat\")","v":"Thu"},"21:00:00",5009,8.18,118,"",{"$f":"VLOOKUP(EpisodeList[[#This Row],[Season Number]], INDIRECT(\"'\" & EpisodeList[[#This Row],[Show]] & \" Season Info'!C2:J15\"), 8,1)","v":"2008-09"}]
["30 Rock","Season 3",3,{"$f":"A120& \" S\" &C120","v":"30 Rock S3"},39,3,"\"The One with the Cast of Night Court\"","Gail Mancuso","Jack Burditt","2008-11-13",{"$f":"CHOOSE(WEEKDAY(J120),\"Sun\",\"Mon\",\"Tue\",\"Wed\",\"Thu\",\"Fri\",\"Sat\")","v":"Thu"},"21:30:00",303,7.5,119,"",{"$f":"VLOOKUP(EpisodeList[[#This Row],[Season Number]], INDIRECT(\"'\" & EpisodeList[[#This Row],[Show]] & \" Season Info'!C2:J15\"), 8,1)","v":"2008-09"}]
["The Office","Season 5",5,{"$f":"A121& \" S\" &C121","v":"The Office S5"},81,9,"\"Frame Toby\"","Jason Reitman","Mindy Kaling","2008-11-20",{"$f":"CHOOSE(WEEKDAY(J121),\"Sun\",\"Mon\",\"Tue\",\"Wed\",\"Thu\",\"Fri\",\"Sat\")","v":"Thu"},"21:00:00",5008,8.4,120,"",{"$f":"VLOOKUP(EpisodeList[[#This Row],[Season Number]], INDIRECT(\"'\" & EpisodeList[[#This Row],[Show]] & \" Season Info'!C2:J15\"), 8,1)","v":"2008-09"}]
["30 Rock","Season 3",3,{"$f":"A122& \" S\" &C122","v":"30 Rock S3"},40,4,"\"Gavin Volure\"","Gail Mancuso","John Riggi","2008-11-20",{"$f":"CHOOSE(WEEKDAY(J122),\"Sun\",\"Mon\",\"Tue\",\"Wed\",\"Thu\",\"Fri\",\"Sat\")","v":"Thu"},"21:30:00",304,7.3,121,"",{"$f":"VLOOKUP(EpisodeList[[#This Row],[Season Number]], INDIRECT(\"'\" & EpisodeList[[#This Row],[Show]] & \" Season Info'!C2:J15\"), 8,1)","v":"2008-09"}]
["The Office","Season 5",5,{"$f":"A123& \" S\" &C123","v":"The Office S5"},82,10,"\"The Surplus\"","Paul Feig","Gene Stupnitsky & Lee Eisenberg","2008-12-04",{"$f":"CHOOSE(WEEKDAY(J123),\"Sun\",\"Mon\",\"Tue\",\"Wed\",\"Thu\",\"Fri\",\"Sat\")","v":"Thu"},"21:00:00",5013,8.33,122,"",{"$f":"VLOOKUP(EpisodeList[[#This Row],[Season Number]], INDIRECT(\"'\" & EpisodeList[[#This Row],[Show]] & \" Season Info'!C2:J15\"), 8,1)","v":"2008-09"}]
["30 Rock","Season 3",3,{"$f":"A124& \" S\" &C124","v":"30 Rock S3"},41,5,"\"Reunion\"","Beth McCarthy","Matt Hubbard","2008-12-04",{"$f":"CHOOSE(WEEKDAY(J124),\"Sun\",\"Mon\",\"Tue\",\"Wed\",\"Thu\",\"Fri\",\"Sat\")","v":"Thu"},"21:30:00",305,7.1,123,"",{"$f":"VLOOKUP(EpisodeList[[#This Row],[Season Number]], INDIRECT(\"'\" & EpisodeList[[#This Row],[Show]] & \" Season Info'!C2:J15\"), 8,1)","v":"2008-09"}]
["The Office","Season 5",5,{"$f":"A125& \" S\" &C125","v":"The Office S5"},83,11,"\"Moroccan Christmas\"","Paul Feig","Justin Spitzer","2008-12-11",{"$f":"CHOOSE(WEEKDAY(J125),\"Sun\",\"Mon\",\"Tue\",\"Wed\",\"Thu\",\"Fri\",\"Sat\")","v":"Thu"},"21:00:00",5010,8.7899999999999991,124,"",{"$f":"VLOOKUP(EpisodeList[[#This Row],[Season Number]], INDIRECT(\"'\" & EpisodeList[[#This Row],[Show]] & \" Season Info'!C2:J15\"), 8,1)","v":"2008-09"}]
["30 Rock","Season 3",3,{"$f":"A126& \" S\" &C126","v":"30 Rock S3"},42,6,"\"Christmas Special\"","Don Scardino","Kay Cannon & Tina Fey","2008-12-11",{"$f":"CHOOSE(WEEKDAY(J126),\"Sun\",\"Mon\",\"Tue\",\"Wed\",\"Thu\",\"Fri\",\"Sat\")","v":"Thu"},"21:30:00",306,8.9,125,"",{"$f":"VLOOKUP(EpisodeList[[#This Row],[Season Number]], INDIRECT(\"'\" & EpisodeList[[#This Row],[Show]] & \" Season Info'!C2:J15\"), 8,1)","v":"2008-09"}]
["30 Rock","Season 3",3,{"$f":"A127& \" S\" &C127","v":"30 Rock S3"},43,7,"\"Se√±or Macho Solo\"","Beth McCarthy","Ron Weiner","2009-01-08",{"$f":"CHOOSE(WEEKDAY(J127),\"Sun\",\"Mon\",\"Tue\",\"Wed\",\"Thu\",\"Fri\",\"Sat\")","v":"Thu"},"21:30:00",307,5.4,126,"",{"$f":"VLOOKUP(EpisodeList[[#This Row],[Season Number]], INDIRECT(\"'\" & EpisodeList[[#This Row],[Show]] & \" Season Info'!C2:J15\"), 8,1)","v":"2008-09"}]
["The Office","Season 5",5,{"$f":"A128& \" S\" &C128","v":"The Office S5"},84,12,"\"The Duel\"","Dean Holland","Jennifer Celotta","2009-01-15",{"$f":"CHOOSE(WEEKDAY(J128),\"Sun\",\"Mon\",\"Tue\",\"Wed\",\"Thu\",\"Fri\",\"Sat\")","v":"Thu"},"21:00:00",5011,8.5,127,"",{"$f":"VLOOKUP(EpisodeList[[#This Row],[Season Number]], INDIRECT(\"'\" & EpisodeList[[#This Row],[Show]] & \" Season Info'!C2:J15\"), 8,1)","v":"2008-09"}]
["30 Rock","Season 3",3,{"$f":"A129& \" S\" &C129","v":"30 Rock S3"},44,8,"\"Flu Shot\"","Don Scardino","Jon Pollack","2009-01-15",{"$f":"CHOOSE(WEEKDAY(J129),\"Sun\",\"Mon\",\"Tue\",\"Wed\",\"Thu\",\"Fri\",\"Sat\")","v":"Thu"},"21:30:00",308,6.6,128,"",{"$f":"VLOOKUP(EpisodeList[[#This Row],[Season Number]], INDIRECT(\"'\" & EpisodeList[[#This Row],[Show]] & \" Season Info'!C2:J15\"), 8,1)","v":"2008-09"}]
["The Office","Season 5",5,{"$f":"A130& \" S\" &C130","v":"The Office S5"},85,13,"\"Prince Family Paper\"","Asaad Kelada","B. J. Novak","2009-01-22",{"$f":"CHOOSE(WEEKDAY(J130),\"Sun\",\"Mon\",\"Tue\",\"Wed\",\"Thu\",\"Fri\",\"Sat\")","v":"Thu"},"21:00:00",5012,8.74,129,{"$f":"IF(AND(\n    COUNTIFS(A:A, A130, J:J, J130) = 1,\n    COUNTIFS(A:A, \"30 Rock\", J:J, J130) = 1,\n    COUNTIFS(A:A, \"The Office\", J:J, J130) = 1,\n    COUNTIFS(A:A, \"Community\", J:J, J130) = 1,\n    COUNTIFS(A:A, \"Parks and Rec\", J:J, J130) = 1\n), \"Yes\", \"\")","v":""},{"$f":"VLOOKUP(EpisodeList[[#This Row],[Season Number]], INDIRECT(\"'\" & EpisodeList[[#This Row],[Show]] & \" Season Info'!C2:J15\"), 8,1)","v":"2008-09"}]
["30 Rock","Season 3",3,{"$f":"A131& \" S\" &C131","v":"30 Rock S3"},45,9,"\"Retreat to Move Forward\"","Steve Buscemi","Tami Sagher","2009-01-22",{"$f":"CHOOSE(WEEKDAY(J131),\"Sun\",\"Mon\",\"Tue\",\"Wed\",\"Thu\",\"Fri\",\"Sat\")","v":"Thu"},"21:30:00",309,6.4,130,"",{"$f":"VLOOKUP(EpisodeList[[#This Row],[Season Number]], INDIRECT(\"'\" & EpisodeList[[#This Row],[Show]] & \" Season Info'!C2:J15\"), 8,1)","v":"2008-09"}]
["The Office","Season 5",5,{"$f":"A132& \" S\" &C132","v":"The Office S5"},86,14,"\"Stress Relief\"","Jeffrey Blitz","Paul Lieberstein","2009-02-01",{"$f":"CHOOSE(WEEKDAY(J132),\"Sun\",\"Mon\",\"Tue\",\"Wed\",\"Thu\",\"Fri\",\"Sat\")","v":"Sun"},"N/A",5016,22.91,131,"",{"$f":"VLOOKUP(EpisodeList[[#This Row],[Season Number]], INDIRECT(\"'\" & EpisodeList[[#This Row],[Show]] & \" Season Info'!C2:J15\"), 8,1)","v":"2008-09"}]
["The Office","Season 5",5,{"$f":"A133& \" S\" &C133","v":"The Office S5"},87,15,"\"Stress Relief\"","Jeffrey Blitz","Paul Lieberstein","2009-02-01",{"$f":"CHOOSE(WEEKDAY(J133),\"Sun\",\"Mon\",\"Tue\",\"Wed\",\"Thu\",\"Fri\",\"Sat\")","v":"Sun"},"N/A",5017,22.91,132,"",{"$f":"VLOOKUP(EpisodeList[[#This Row],[Season Number]], INDIRECT(\"'\" & EpisodeList[[#This Row],[Show]] & \" Season Info'!C2:J15\"), 8,1)","v":"2008-09"}]
["The Office","Season 5",5,{"$f":"A134& \" S\" &C134","v":"The Office S5"},88,16,"\"Lecture Circuit: Part 1\"","Ken Kwapis","Mindy Kaling","2009-02-05",{"$f":"CHOOSE(WEEKDAY(J134),\"Sun\",\"Mon\",\"Tue\",\"Wed\",\"Thu\",\"Fri\",\"Sat\")","v":"Thu"},"21:00:00",5014,8.39,133,"",{"$f":"VLOOKUP(EpisodeList[[#This Row],[Season Number]], INDIRECT(\"'\" & EpisodeList[[#This Row],[Show]] & \" Season Info'!C2:J15\"), 8,1)","v":"2008-09"}]
["30 Rock","Season 3",3,{"$f":"A135& \" S\" &C135","v":"30 Rock S3"},46,10,"\"Generalissimo\"","Todd Holland","Robert Carlock","2009-02-05",{"$f":"CHOOSE(WEEKDAY(J135),\"Sun\",\"Mon\",\"Tue\",\"Wed\",\"Thu\",\"Fri\",\"Sat\")","v":"Thu"},"21:30:00",310,6.4,134,"",{"$f":"VLOOKUP(EpisodeList[[#This Row],[Season Number]], INDIRECT(\"'\" & EpisodeList[[#This Row],[Show]] & \" Season Info'!C2:J15\"), 8,1)","v":"2008-09"}]
["The Office","Season 5",5,{"$f":"A136& \" S\" &C136","v":"The Office S5"},89,17,"\"Lecture Circuit: Part 2\"","Ken Kwapis","Mindy Kaling","2009-02-12",{"$f":"CHOOSE(WEEKDAY(J136),\"Sun\",\"Mon\",\"Tue\",\"Wed\",\"Thu\",\"Fri\",\"Sat\")","v":"Thu"},"21:00:00",5015,8.89,135,"",{"$f":"VLOOKUP(EpisodeList[[#This Row],[Season Number]], INDIRECT(\"'\" & EpisodeList[[#This Row],[Show]] & \" Season Info'!C2:J15\"), 8,1)","v":"2008-09"}]
["30 Rock","Season 3",3,{"$f":"A137& \" S\" &C137","v":"30 Rock S3"},47,11,"\"St. Valentine's Day\"","Don Scardino","Jack Burditt & Tina Fey","2009-02-12",{"$f":"CHOOSE(WEEKDAY(J137),\"Sun\",\"Mon\",\"Tue\",\"Wed\",\"Thu\",\"Fri\",\"Sat\")","v":"Thu"},"21:30:00",311,7.6,136,"",{"$f":"VLOOKUP(EpisodeList[[#This Row],[Season Number]], INDIRECT(\"'\" & EpisodeList[[#This Row],[Show]] & \" Season Info'!C2:J15\"), 8,1)","v":"2008-09"}]
["30 Rock","Season 3",3,{"$f":"A138& \" S\" &C138","v":"30 Rock S3"},48,12,"\"Larry King\"","Constantine Makris","Matt Hubbard","2009-02-26",{"$f":"CHOOSE(WEEKDAY(J138),\"Sun\",\"Mon\",\"Tue\",\"Wed\",\"Thu\",\"Fri\",\"Sat\")","v":"Thu"},"21:30:00",312,6.4,137,"",{"$f":"VLOOKUP(EpisodeList[[#This Row],[Season Number]], INDIRECT(\"'\" & EpisodeList[[#This Row],[Show]] & \" Season Info'!C2:J15\"), 8,1)","v":"2008-09"}]
["The Office","Season 5",5,{"$f":"A139& \" S\" &C139","v":"The Office S5"},90,18,"\"Blood Drive\"","Randall Einhorn","Brent Forrester","2009-03-05",{"$f":"CHOOSE(WEEKDAY(J139),\"Sun\",\"Mon\",\"Tue\",\"Wed\",\"Thu\",\"Fri\",\"Sat\")","v":"Thu"},"21:00:00",5018,8.6300000000000008,138,"",{"$f":"VLOOKUP(EpisodeList[[#This Row],[Season Number]], INDIRECT(\"'\" & EpisodeList[[#This Row],[Show]] & \" Season Info'!C2:J15\"), 8,1)","v":"2008-09"}]
["30 Rock","Season 3",3,{"$f":"A140& \" S\" &C140","v":"30 Rock S3"},49,13,"\"Goodbye, My Friend\"","John Riggi","Ron Weiner","2009-03-05",{"$f":"CHOOSE(WEEKDAY(J140),\"Sun\",\"Mon\",\"Tue\",\"Wed\",\"Thu\",\"Fri\",\"Sat\")","v":"Thu"},"21:30:00",313,7.3,139,"",{"$f":"VLOOKUP(EpisodeList[[#This Row],[Season Number]], INDIRECT(\"'\" & EpisodeList[[#This Row],[Show]] & \" Season Info'!C2:J15\"), 8,1)","v":"2008-09"}]
["The Office","Season 5",5,{"$f":"A141& \" S\" &C141","v":"The Office S5"},91,19,"\"Golden Ticket\"","Randall Einhorn","Mindy Kaling","2009-03-12",{"$f":"CHOOSE(WEEKDAY(J141),\"Sun\",\"Mon\",\"Tue\",\"Wed\",\"Thu\",\"Fri\",\"Sat\")","v":"Thu"},"21:00:00",5019,7.51,140,"",{"$f":"VLOOKUP(EpisodeList[[#This Row],[Season Number]], INDIRECT(\"'\" & EpisodeList[[#This Row],[Show]] & \" Season Info'!C2:J15\"), 8,1)","v":"2008-09"}]
["30 Rock","Season 3",3,{"$f":"A142& \" S\" &C142","v":"30 Rock S3"},50,14,"\"The Funcooker\"","Ken Whittingham","Donald Glover & Tom Ceraulo","2009-03-12",{"$f":"CHOOSE(WEEKDAY(J142),\"Sun\",\"Mon\",\"Tue\",\"Wed\",\"Thu\",\"Fri\",\"Sat\")","v":"Thu"},"21:30:00",314,6.4,141,"",{"$f":"VLOOKUP(EpisodeList[[#This Row],[Season Number]], INDIRECT(\"'\" & EpisodeList[[#This Row],[Show]] & \" Season Info'!C2:J15\"), 8,1)","v":"2008-09"}]
["The Office","Season 5",5,{"$f":"A143& \" S\" &C143","v":"The Office S5"},92,20,"\"New Boss\"","Paul Feig","Lee Eisenberg & Gene Stupnitsky","2009-03-19",{"$f":"CHOOSE(WEEKDAY(J143),\"Sun\",\"Mon\",\"Tue\",\"Wed\",\"Thu\",\"Fri\",\"Sat\")","v":"Thu"},"21:00:00",5020,7.95,142,"",{"$f":"VLOOKUP(EpisodeList[[#This Row],[Season Number]], INDIRECT(\"'\" & EpisodeList[[#This Row],[Show]] & \" Season Info'!C2:J15\"), 8,1)","v":"2008-09"}]
["30 Rock","Season 3",3,{"$f":"A144& \" S\" &C144","v":"30 Rock S3"},51,15,"\"The Bubble\"","Tricia Brock","Tina Fey","2009-03-19",{"$f":"CHOOSE(WEEKDAY(J144),\"Sun\",\"Mon\",\"Tue\",\"Wed\",\"Thu\",\"Fri\",\"Sat\")","v":"Thu"},"21:30:00",315,7.1,143,"",{"$f":"VLOOKUP(EpisodeList[[#This Row],[Season Number]], INDIRECT(\"'\" & EpisodeList[[#This Row],[Show]] & \" Season Info'!C2:J15\"), 8,1)","v":"2008-09"}]
["The Office","Season 5",5,{"$f":"A145& \" S\" &C145","v":"The Office S5"},93,21,"\"Two Weeks\"","Paul Lieberstein","Aaron Shure","2009-03-26",{"$f":"CHOOSE(WEEKDAY(J145),\"Sun\",\"Mon\",\"Tue\",\"Wed\",\"Thu\",\"Fri\",\"Sat\")","v":"Thu"},"21:00:00",5021,8.4499999999999993,144,"",{"$f":"VLOOKUP(EpisodeList[[#This Row],[Season Number]], INDIRECT(\"'\" & EpisodeList[[#This Row],[Show]] & \" Season Info'!C2:J15\"), 8,1)","v":"2008-09"}]
["30 Rock","Season 3",3,{"$f":"A146& \" S\" &C146","v":"30 Rock S3"},52,16,"\"Apollo, Apollo\"","Millicent Shelton","Robert Carlock","2009-03-26",{"$f":"CHOOSE(WEEKDAY(J146),\"Sun\",\"Mon\",\"Tue\",\"Wed\",\"Thu\",\"Fri\",\"Sat\")","v":"Thu"},"21:30:00",316,7.2,145,"",{"$f":"VLOOKUP(EpisodeList[[#This Row],[Season Number]], INDIRECT(\"'\" & EpisodeList[[#This Row],[Show]] & \" Season Info'!C2:J15\"), 8,1)","v":"2008-09"}]
["Parks and Rec","Season 1",1,{"$f":"A147& \" S\" &C147","v":"Parks and Rec S1"},1,1,"\"Pilot\"","Greg Daniels","Greg Daniels & Michael Schur","2009-04-09",{"$f":"CHOOSE(WEEKDAY(J147),\"Sun\",\"Mon\",\"Tue\",\"Wed\",\"Thu\",\"Fri\",\"Sat\")","v":"Thu"},"20:30:00",null,6.77,146,"",{"$f":"VLOOKUP(EpisodeList[[#This Row],[Season Number]], INDIRECT(\"'\" & EpisodeList[[#This Row],[Show]] & \" Season Info'!C2:J15\"), 8,1)","v":"2008-09"}]
["The Office","Season 5",5,{"$f":"A148& \" S\" &C148","v":"The Office S5"},94,22,"\"Dream Team\"","Paul Feig","B. J. Novak","2009-04-09",{"$f":"CHOOSE(WEEKDAY(J148),\"Sun\",\"Mon\",\"Tue\",\"Wed\",\"Thu\",\"Fri\",\"Sat\")","v":"Thu"},"21:00:00",5022,7.2,147,"",{"$f":"VLOOKUP(EpisodeList[[#This Row],[Season Number]], INDIRECT(\"'\" & EpisodeList[[#This Row],[Show]] & \" Season Info'!C2:J15\"), 8,1)","v":"2008-09"}]
["The Office","Season 5",5,{"$f":"A149& \" S\" &C149","v":"The Office S5"},95,23,"\"Michael Scott Paper Company\"","Gene Stupnitsky","Justin Spitzer","2009-04-09",{"$f":"CHOOSE(WEEKDAY(J149),\"Sun\",\"Mon\",\"Tue\",\"Wed\",\"Thu\",\"Fri\",\"Sat\")","v":"Thu"},"21:00:00",5023,7.94,148,"",{"$f":"VLOOKUP(EpisodeList[[#This Row],[Season Number]], INDIRECT(\"'\" & EpisodeList[[#This Row],[Show]] & \" Season Info'!C2:J15\"), 8,1)","v":"2008-09"}]
["30 Rock","Season 3",3,{"$f":"A150& \" S\" &C150","v":"30 Rock S3"},53,17,"\"Cutbacks\"","Gail Mancuso","Matt Hubbard","2009-04-09",{"$f":"CHOOSE(WEEKDAY(J150),\"Sun\",\"Mon\",\"Tue\",\"Wed\",\"Thu\",\"Fri\",\"Sat\")","v":"Thu"},"21:30:00",317,6.8,149,"",{"$f":"VLOOKUP(EpisodeList[[#This Row],[Season Number]], INDIRECT(\"'\" & EpisodeList[[#This Row],[Show]] & \" Season Info'!C2:J15\"), 8,1)","v":"2008-09"}]
["Parks and Rec","Season 1",1,{"$f":"A151& \" S\" &C151","v":"Parks and Rec S1"},2,2,"\"Canvassing\"","Seth Gordon","Rachel Axler","2009-04-16",{"$f":"CHOOSE(WEEKDAY(J151),\"Sun\",\"Mon\",\"Tue\",\"Wed\",\"Thu\",\"Fri\",\"Sat\")","v":"Thu"},"20:30:00",null,5.92,150,"",{"$f":"VLOOKUP(EpisodeList[[#This Row],[Season Number]], INDIRECT(\"'\" & EpisodeList[[#This Row],[Show]] & \" Season Info'!C2:J15\"), 8,1)","v":"2008-09"}]
["The Office","Season 5",5,{"$f":"A152& \" S\" &C152","v":"The Office S5"},96,24,"\"Heavy Competition\"","Ken Whittingham","Ryan Koh","2009-04-16",{"$f":"CHOOSE(WEEKDAY(J152),\"Sun\",\"Mon\",\"Tue\",\"Wed\",\"Thu\",\"Fri\",\"Sat\")","v":"Thu"},"21:00:00",5024,8.24,151,"",{"$f":"VLOOKUP(EpisodeList[[#This Row],[Season Number]], INDIRECT(\"'\" & EpisodeList[[#This Row],[Show]] & \" Season Info'!C2:J15\"), 8,1)","v":"2008-09"}]
["30 Rock","Season 3",3,{"$f":"A153& \" S\" &C153","v":"30 Rock S3"},54,18,"\"Jackie Jormp-Jomp\"","Don Scardino","Kay Cannon & Tracey Wigfield","2009-04-16",{"$f":"CHOOSE(WEEKDAY(J153),\"Sun\",\"Mon\",\"Tue\",\"Wed\",\"Thu\",\"Fri\",\"Sat\")","v":"Thu"},"21:30:00",318,7.3,152,"",{"$f":"VLOOKUP(EpisodeList[[#This Row],[Season Number]], INDIRECT(\"'\" & EpisodeList[[#This Row],[Show]] & \" Season Info'!C2:J15\"), 8,1)","v":"2008-09"}]
["Parks and Rec","Season 1",1,{"$f":"A154& \" S\" &C154","v":"Parks and Rec S1"},3,3,"\"The Reporter\"","Jeffrey Blitz","Dan Goor","2009-04-23",{"$f":"CHOOSE(WEEKDAY(J154),\"Sun\",\"Mon\",\"Tue\",\"Wed\",\"Thu\",\"Fri\",\"Sat\")","v":"Thu"},"20:30:00",null,5.24,153,"",{"$f":"VLOOKUP(EpisodeList[[#This Row],[Season Number]], INDIRECT(\"'\" & EpisodeList[[#This Row],[Show]] & \" Season Info'!C2:J15\"), 8,1)","v":"2008-09"}]
["The Office","Season 5",5,{"$f":"A155& \" S\" &C155","v":"The Office S5"},97,25,"\"Broke\"","Steve Carell","Charlie Grandy","2009-04-23",{"$f":"CHOOSE(WEEKDAY(J155),\"Sun\",\"Mon\",\"Tue\",\"Wed\",\"Thu\",\"Fri\",\"Sat\")","v":"Thu"},"21:00:00",5025,7.21,154,"",{"$f":"VLOOKUP(EpisodeList[[#This Row],[Season Number]], INDIRECT(\"'\" & EpisodeList[[#This Row],[Show]] & \" Season Info'!C2:J15\"), 8,1)","v":"2008-09"}]
["30 Rock","Season 3",3,{"$f":"A156& \" S\" &C156","v":"30 Rock S3"},55,19,"\"The Ones\"","Beth McCarthy","Jack Burditt","2009-04-23",{"$f":"CHOOSE(WEEKDAY(J156),\"Sun\",\"Mon\",\"Tue\",\"Wed\",\"Thu\",\"Fri\",\"Sat\")","v":"Thu"},"21:30:00",319,6.3,155,"",{"$f":"VLOOKUP(EpisodeList[[#This Row],[Season Number]], INDIRECT(\"'\" & EpisodeList[[#This Row],[Show]] & \" Season Info'!C2:J15\"), 8,1)","v":"2008-09"}]
["Parks and Rec","Season 1",1,{"$f":"A157& \" S\" &C157","v":"Parks and Rec S1"},4,4,"\"Boys' Club\"","Michael McCullers","Alan Yang","2009-04-30",{"$f":"CHOOSE(WEEKDAY(J157),\"Sun\",\"Mon\",\"Tue\",\"Wed\",\"Thu\",\"Fri\",\"Sat\")","v":"Thu"},"20:30:00",null,5.29,156,"",{"$f":"VLOOKUP(EpisodeList[[#This Row],[Season Number]], INDIRECT(\"'\" & EpisodeList[[#This Row],[Show]] & \" Season Info'!C2:J15\"), 8,1)","v":"2008-09"}]
["The Office","Season 5",5,{"$f":"A158& \" S\" &C158","v":"The Office S5"},98,26,"\"Casual Friday\"","Brent Forrester","Anthony Q. Farrell","2009-04-30",{"$f":"CHOOSE(WEEKDAY(J158),\"Sun\",\"Mon\",\"Tue\",\"Wed\",\"Thu\",\"Fri\",\"Sat\")","v":"Thu"},"21:00:00",5026,7.31,157,"",{"$f":"VLOOKUP(EpisodeList[[#This Row],[Season Number]], INDIRECT(\"'\" & EpisodeList[[#This Row],[Show]] & \" Season Info'!C2:J15\"), 8,1)","v":"2008-09"}]
["30 Rock","Season 3",3,{"$f":"A159& \" S\" &C159","v":"30 Rock S3"},56,20,"\"The Natural Order\"","Scott Ellis","John Riggi & Tina Fey","2009-04-30",{"$f":"CHOOSE(WEEKDAY(J159),\"Sun\",\"Mon\",\"Tue\",\"Wed\",\"Thu\",\"Fri\",\"Sat\")","v":"Thu"},"21:30:00",320,6,158,"",{"$f":"VLOOKUP(EpisodeList[[#This Row],[Season Number]], INDIRECT(\"'\" & EpisodeList[[#This Row],[Show]] & \" Season Info'!C2:J15\"), 8,1)","v":"2008-09"}]
["Parks and Rec","Season 1",1,{"$f":"A160& \" S\" &C160","v":"Parks and Rec S1"},5,5,"\"The Banquet\"","Beth McCarthy-Miller","Tucker Cawley","2009-05-07",{"$f":"CHOOSE(WEEKDAY(J160),\"Sun\",\"Mon\",\"Tue\",\"Wed\",\"Thu\",\"Fri\",\"Sat\")","v":"Thu"},"20:30:00",null,4.6399999999999997,159,"",{"$f":"VLOOKUP(EpisodeList[[#This Row],[Season Number]], INDIRECT(\"'\" & EpisodeList[[#This Row],[Show]] & \" Season Info'!C2:J15\"), 8,1)","v":"2008-09"}]
["The Office","Season 5",5,{"$f":"A161& \" S\" &C161","v":"The Office S5"},99,27,"\"Cafe Disco\"","Randall Einhorn","Warren Lieberstein & Halsted Sullivan","2009-05-07",{"$f":"CHOOSE(WEEKDAY(J161),\"Sun\",\"Mon\",\"Tue\",\"Wed\",\"Thu\",\"Fri\",\"Sat\")","v":"Thu"},"21:00:00",5027,7.71,160,"",{"$f":"VLOOKUP(EpisodeList[[#This Row],[Season Number]], INDIRECT(\"'\" & EpisodeList[[#This Row],[Show]] & \" Season Info'!C2:J15\"), 8,1)","v":"2008-09"}]
["30 Rock","Season 3",3,{"$f":"A162& \" S\" &C162","v":"30 Rock S3"},57,21,"\"Mamma Mia\"","Don Scardino","Ron Weiner","2009-05-07",{"$f":"CHOOSE(WEEKDAY(J162),\"Sun\",\"Mon\",\"Tue\",\"Wed\",\"Thu\",\"Fri\",\"Sat\")","v":"Thu"},"21:30:00",321,6.2,161,"",{"$f":"VLOOKUP(EpisodeList[[#This Row],[Season Number]], INDIRECT(\"'\" & EpisodeList[[#This Row],[Show]] & \" Season Info'!C2:J15\"), 8,1)","v":"2008-09"}]
["Parks and Rec","Season 1",1,{"$f":"A163& \" S\" &C163","v":"Parks and Rec S1"},6,6,"\"Rock Show\"","Michael Schur","Norm Hiscock","2009-05-14",{"$f":"CHOOSE(WEEKDAY(J163),\"Sun\",\"Mon\",\"Tue\",\"Wed\",\"Thu\",\"Fri\",\"Sat\")","v":"Thu"},"20:30:00",null,4.25,162,"",{"$f":"VLOOKUP(EpisodeList[[#This Row],[Season Number]], INDIRECT(\"'\" & EpisodeList[[#This Row],[Show]] & \" Season Info'!C2:J15\"), 8,1)","v":"2008-09"}]
["The Office","Season 5",5,{"$f":"A164& \" S\" &C164","v":"The Office S5"},100,28,"\"Company Picnic\"","Ken Kwapis","Jennifer Celotta & Paul Lieberstein","2009-05-14",{"$f":"CHOOSE(WEEKDAY(J164),\"Sun\",\"Mon\",\"Tue\",\"Wed\",\"Thu\",\"Fri\",\"Sat\")","v":"Thu"},"21:00:00",5028,6.72,163,"",{"$f":"VLOOKUP(EpisodeList[[#This Row],[Season Number]], INDIRECT(\"'\" & EpisodeList[[#This Row],[Show]] & \" Season Info'!C2:J15\"), 8,1)","v":"2008-09"}]
["30 Rock","Season 3",3,{"$f":"A165& \" S\" &C165","v":"30 Rock S3"},58,22,"\"Kidney Now!\"","Don Scardino","Jack Burditt & Robert Carlock","2009-05-14",{"$f":"CHOOSE(WEEKDAY(J165),\"Sun\",\"Mon\",\"Tue\",\"Wed\",\"Thu\",\"Fri\",\"Sat\")","v":"Thu"},"21:30:00",322,5.7,164,"",{"$f":"VLOOKUP(EpisodeList[[#This Row],[Season Number]], INDIRECT(\"'\" & EpisodeList[[#This Row],[Show]] & \" Season Info'!C2:J15\"), 8,1)","v":"2008-09"}]
["Parks and Rec","Season 2",2,{"$f":"A166& \" S\" &C166","v":"Parks and Rec S2"},7,1,"\"Pawnee Zoo\"","Paul Feig","Norm Hiscock","2009-09-17",{"$f":"CHOOSE(WEEKDAY(J166),\"Sun\",\"Mon\",\"Tue\",\"Wed\",\"Thu\",\"Fri\",\"Sat\")","v":"Thu"},"20:30:00",null,5,165,"",{"$f":"VLOOKUP(EpisodeList[[#This Row],[Season Number]], INDIRECT(\"'\" & EpisodeList[[#This Row],[Show]] & \" Season Info'!C2:J15\"), 8,1)","v":"2009-10"}]
["The Office","Season 6",6,{"$f":"A167& \" S\" &C167","v":"The Office S6"},101,1,"\"Gossip\"","Paul Lieberstein","Paul Lieberstein","2009-09-17",{"$f":"CHOOSE(WEEKDAY(J167),\"Sun\",\"Mon\",\"Tue\",\"Wed\",\"Thu\",\"Fri\",\"Sat\")","v":"Thu"},"21:00:00",6001,8.1999999999999993,166,"",{"$f":"VLOOKUP(EpisodeList[[#This Row],[Season Number]], INDIRECT(\"'\" & EpisodeList[[#This Row],[Show]] & \" Season Info'!C2:J15\"), 8,1)","v":"2009-10"}]
["Community","Season 1",1,{"$f":"A168& \" S\" &C168","v":"Community S1"},1,1,"\"Pilot\"","Anthony Russo & Joe Russo","Dan Harmon","2009-09-17",{"$f":"CHOOSE(WEEKDAY(J168),\"Sun\",\"Mon\",\"Tue\",\"Wed\",\"Thu\",\"Fri\",\"Sat\")","v":"Thu"},"21:30:00",100,7.89,167,"",{"$f":"VLOOKUP(EpisodeList[[#This Row],[Season Number]], INDIRECT(\"'\" & EpisodeList[[#This Row],[Show]] & \" Season Info'!C2:J15\"), 8,1)","v":"2009-10"}]
["Parks and Rec","Season 2",2,{"$f":"A169& \" S\" &C169","v":"Parks and Rec S2"},8,2,"\"The Stakeout\"","Seth Gordon","Rachel Axler","2009-09-24",{"$f":"CHOOSE(WEEKDAY(J169),\"Sun\",\"Mon\",\"Tue\",\"Wed\",\"Thu\",\"Fri\",\"Sat\")","v":"Thu"},"20:30:00",null,4.22,168,"",{"$f":"VLOOKUP(EpisodeList[[#This Row],[Season Number]], INDIRECT(\"'\" & EpisodeList[[#This Row],[Show]] & \" Season Info'!C2:J15\"), 8,1)","v":"2009-10"}]
["The Office","Season 6",6,{"$f":"A170& \" S\" &C170","v":"The Office S6"},102,2,"\"The Meeting\"","Randall Einhorn","Aaron Shure","2009-09-24",{"$f":"CHOOSE(WEEKDAY(J170),\"Sun\",\"Mon\",\"Tue\",\"Wed\",\"Thu\",\"Fri\",\"Sat\")","v":"Thu"},"21:00:00",6002,7.33,169,"",{"$f":"VLOOKUP(EpisodeList[[#This Row],[Season Number]], INDIRECT(\"'\" & EpisodeList[[#This Row],[Show]] & \" Season Info'!C2:J15\"), 8,1)","v":"2009-10"}]
["Community","Season 1",1,{"$f":"A171& \" S\" &C171","v":"Community S1"},2,2,"\"Spanish 101\"","Joe Russo","Dan Harmon","2009-09-24",{"$f":"CHOOSE(WEEKDAY(J171),\"Sun\",\"Mon\",\"Tue\",\"Wed\",\"Thu\",\"Fri\",\"Sat\")","v":"Thu"},"21:30:00",101,5.39,170,"",{"$f":"VLOOKUP(EpisodeList[[#This Row],[Season Number]], INDIRECT(\"'\" & EpisodeList[[#This Row],[Show]] & \" Season Info'!C2:J15\"), 8,1)","v":"2009-10"}]
["Parks and Rec","Season 2",2,{"$f":"A172& \" S\" &C172","v":"Parks and Rec S2"},9,3,"\"Beauty Pageant\"","Jason Woliner","Katie Dippold","2009-10-01",{"$f":"CHOOSE(WEEKDAY(J172),\"Sun\",\"Mon\",\"Tue\",\"Wed\",\"Thu\",\"Fri\",\"Sat\")","v":"Thu"},"20:30:00",null,4.63,171,"",{"$f":"VLOOKUP(EpisodeList[[#This Row],[Season Number]], INDIRECT(\"'\" & EpisodeList[[#This Row],[Show]] & \" Season Info'!C2:J15\"), 8,1)","v":"2009-10"}]
["The Office","Season 6",6,{"$f":"A173& \" S\" &C173","v":"The Office S6"},103,3,"\"The Promotion\"","Jennifer Celotta","Jennifer Celotta","2009-10-01",{"$f":"CHOOSE(WEEKDAY(J173),\"Sun\",\"Mon\",\"Tue\",\"Wed\",\"Thu\",\"Fri\",\"Sat\")","v":"Thu"},"21:00:00",6003,7.28,172,"",{"$f":"VLOOKUP(EpisodeList[[#This Row],[Season Number]], INDIRECT(\"'\" & EpisodeList[[#This Row],[Show]] & \" Season Info'!C2:J15\"), 8,1)","v":"2009-10"}]
["Community","Season 1",1,{"$f":"A174& \" S\" &C174","v":"Community S1"},3,3,"\"Introduction to Film\"","Anthony Russo","Tim Hobert & Jon Pollack","2009-10-01",{"$f":"CHOOSE(WEEKDAY(J174),\"Sun\",\"Mon\",\"Tue\",\"Wed\",\"Thu\",\"Fri\",\"Sat\")","v":"Thu"},"21:30:00",102,5.86,173,"",{"$f":"VLOOKUP(EpisodeList[[#This Row],[Season Number]], INDIRECT(\"'\" & EpisodeList[[#This Row],[Show]] & \" Season Info'!C2:J15\"), 8,1)","v":"2009-10"}]
["Community","Season 1",1,{"$f":"A175& \" S\" &C175","v":"Community S1"},4,4,"\"Social Psychology\"","Anthony Russo","Liz Cackowski","2009-10-08",{"$f":"CHOOSE(WEEKDAY(J175),\"Sun\",\"Mon\",\"Tue\",\"Wed\",\"Thu\",\"Fri\",\"Sat\")","v":"Thu"},"20:00:00",104,4.87,174,"",{"$f":"VLOOKUP(EpisodeList[[#This Row],[Season Number]], INDIRECT(\"'\" & EpisodeList[[#This Row],[Show]] & \" Season Info'!C2:J15\"), 8,1)","v":"2009-10"}]
["Parks and Rec","Season 2",2,{"$f":"A176& \" S\" &C176","v":"Parks and Rec S2"},10,4,"\"Practice Date\"","Alex Hardcastle","Harris Wittels","2009-10-08",{"$f":"CHOOSE(WEEKDAY(J176),\"Sun\",\"Mon\",\"Tue\",\"Wed\",\"Thu\",\"Fri\",\"Sat\")","v":"Thu"},"20:30:00",null,4.97,175,"",{"$f":"VLOOKUP(EpisodeList[[#This Row],[Season Number]], INDIRECT(\"'\" & EpisodeList[[#This Row],[Show]] & \" Season Info'!C2:J15\"), 8,1)","v":"2009-10"}]
["The Office","Season 6",6,{"$f":"A177& \" S\" &C177","v":"The Office S6"},104,4,"\"Niagara\"","Paul Feig","Greg Daniels & Mindy Kaling","2009-10-08",{"$f":"CHOOSE(WEEKDAY(J177),\"Sun\",\"Mon\",\"Tue\",\"Wed\",\"Thu\",\"Fri\",\"Sat\")","v":"Thu"},"21:00:00",6004,9.42,176,"",{"$f":"VLOOKUP(EpisodeList[[#This Row],[Season Number]], INDIRECT(\"'\" & EpisodeList[[#This Row],[Show]] & \" Season Info'!C2:J15\"), 8,1)","v":"2009-10"}]
["The Office","Season 6",6,{"$f":"A178& \" S\" &C178","v":"The Office S6"},105,5,"\"Niagara\"","Paul Feig","Greg Daniels & Mindy Kaling","2009-10-08",{"$f":"CHOOSE(WEEKDAY(J178),\"Sun\",\"Mon\",\"Tue\",\"Wed\",\"Thu\",\"Fri\",\"Sat\")","v":"Thu"},"21:30:00",6005,9.42,177,"",{"$f":"VLOOKUP(EpisodeList[[#This Row],[Season Number]], INDIRECT(\"'\" & EpisodeList[[#This Row],[Show]] & \" Season Info'!C2:J15\"), 8,1)","v":"2009-10"}]
["Community","Season 1",1,{"$f":"A179& \" S\" &C179","v":"Community S1"},5,5,"\"Advanced Criminal Law\"","Joe Russo","Andrew Guest","2009-10-15",{"$f":"CHOOSE(WEEKDAY(J179),\"Sun\",\"Mon\",\"Tue\",\"Wed\",\"Thu\",\"Fri\",\"Sat\")","v":"Thu"},"20:00:00",105,5.01,178,"Yes",{"$f":"VLOOKUP(EpisodeList[[#This Row],[Season Number]], INDIRECT(\"'\" & EpisodeList[[#This Row],[Show]] & \" Season Info'!C2:J15\"), 8,1)","v":"2009-10"}]
["Parks and Rec","Season 2",2,{"$f":"A180& \" S\" &C180","v":"Parks and Rec S2"},11,5,"\"Sister City\"","Michael Schur","Alan Yang","2009-10-15",{"$f":"CHOOSE(WEEKDAY(J180),\"Sun\",\"Mon\",\"Tue\",\"Wed\",\"Thu\",\"Fri\",\"Sat\")","v":"Thu"},"20:30:00",null,4.6900000000000004,179,"Yes",{"$f":"VLOOKUP(EpisodeList[[#This Row],[Season Number]], INDIRECT(\"'\" & EpisodeList[[#This Row],[Show]] & \" Season Info'!C2:J15\"), 8,1)","v":"2009-10"}]
["The Office","Season 6",6,{"$f":"A181& \" S\" &C181","v":"The Office S6"},106,6,"\"Mafia\"","David Rogers","Brent Forrester","2009-10-15",{"$f":"CHOOSE(WEEKDAY(J181),\"Sun\",\"Mon\",\"Tue\",\"Wed\",\"Thu\",\"Fri\",\"Sat\")","v":"Thu"},"21:00:00",6006,8.1,180,"Yes",{"$f":"VLOOKUP(EpisodeList[[#This Row],[Season Number]], INDIRECT(\"'\" & EpisodeList[[#This Row],[Show]] & \" Season Info'!C2:J15\"), 8,1)","v":"2009-10"}]
["30 Rock","Season 4",4,{"$f":"A182& \" S\" &C182","v":"30 Rock S4"},59,1,"\"Season 4\"","Don Scardino","Tina Fey","2009-10-15",{"$f":"CHOOSE(WEEKDAY(J182),\"Sun\",\"Mon\",\"Tue\",\"Wed\",\"Thu\",\"Fri\",\"Sat\")","v":"Thu"},"21:30:00",401,6.39,181,"Yes",{"$f":"VLOOKUP(EpisodeList[[#This Row],[Season Number]], INDIRECT(\"'\" & EpisodeList[[#This Row],[Show]] & \" Season Info'!C2:J15\"), 8,1)","v":"2009-10"}]
["Community","Season 1",1,{"$f":"A183& \" S\" &C183","v":"Community S1"},6,6,"\"Football, Feminism and You\"","Joe Russo","Hilary Winston","2009-10-22",{"$f":"CHOOSE(WEEKDAY(J183),\"Sun\",\"Mon\",\"Tue\",\"Wed\",\"Thu\",\"Fri\",\"Sat\")","v":"Thu"},"20:00:00",103,5.18,182,"Yes",{"$f":"VLOOKUP(EpisodeList[[#This Row],[Season Number]], INDIRECT(\"'\" & EpisodeList[[#This Row],[Show]] & \" Season Info'!C2:J15\"), 8,1)","v":"2009-10"}]
["Parks and Rec","Season 2",2,{"$f":"A184& \" S\" &C184","v":"Parks and Rec S2"},12,6,"\"Kaboom\"","Charles McDougall","Aisha Muharrar","2009-10-22",{"$f":"CHOOSE(WEEKDAY(J184),\"Sun\",\"Mon\",\"Tue\",\"Wed\",\"Thu\",\"Fri\",\"Sat\")","v":"Thu"},"20:30:00",null,4.9800000000000004,183,"Yes",{"$f":"VLOOKUP(EpisodeList[[#This Row],[Season Number]], INDIRECT(\"'\" & EpisodeList[[#This Row],[Show]] & \" Season Info'!C2:J15\"), 8,1)","v":"2009-10"}]
["The Office","Season 6",6,{"$f":"A185& \" S\" &C185","v":"The Office S6"},107,7,"\"The Lover\"","Lee Eisenberg","Lee Eisenberg & Gene Stupnitsky","2009-10-22",{"$f":"CHOOSE(WEEKDAY(J185),\"Sun\",\"Mon\",\"Tue\",\"Wed\",\"Thu\",\"Fri\",\"Sat\")","v":"Thu"},"21:00:00",6007,8.52,184,"Yes",{"$f":"VLOOKUP(EpisodeList[[#This Row],[Season Number]], INDIRECT(\"'\" & EpisodeList[[#This Row],[Show]] & \" Season Info'!C2:J15\"), 8,1)","v":"2009-10"}]
["30 Rock","Season 4",4,{"$f":"A186& \" S\" &C186","v":"30 Rock S4"},60,2,"\"Into the Crevasse\"","Beth McCarthy Miller","Robert Carlock","2009-10-22",{"$f":"CHOOSE(WEEKDAY(J186),\"Sun\",\"Mon\",\"Tue\",\"Wed\",\"Thu\",\"Fri\",\"Sat\")","v":"Thu"},"21:30:00",402,6.68,185,"Yes",{"$f":"VLOOKUP(EpisodeList[[#This Row],[Season Number]], INDIRECT(\"'\" & EpisodeList[[#This Row],[Show]] & \" Season Info'!C2:J15\"), 8,1)","v":"2009-10"}]
["Community","Season 1",1,{"$f":"A187& \" S\" &C187","v":"Community S1"},7,7,"\"Introduction to Statistics\"","Justin Lin","Tim Hobert & Jon Pollack","2009-10-29",{"$f":"CHOOSE(WEEKDAY(J187),\"Sun\",\"Mon\",\"Tue\",\"Wed\",\"Thu\",\"Fri\",\"Sat\")","v":"Thu"},"20:00:00",106,5.32,186,"Yes",{"$f":"VLOOKUP(EpisodeList[[#This Row],[Season Number]], INDIRECT(\"'\" & EpisodeList[[#This Row],[Show]] & \" Season Info'!C2:J15\"), 8,1)","v":"2009-10"}]
["Parks and Rec","Season 2",2,{"$f":"A188& \" S\" &C188","v":"Parks and Rec S2"},13,7,"\"Greg Pikitis\"","Dean Holland","Michael Schur","2009-10-29",{"$f":"CHOOSE(WEEKDAY(J188),\"Sun\",\"Mon\",\"Tue\",\"Wed\",\"Thu\",\"Fri\",\"Sat\")","v":"Thu"},"20:30:00",null,4.96,187,"Yes",{"$f":"VLOOKUP(EpisodeList[[#This Row],[Season Number]], INDIRECT(\"'\" & EpisodeList[[#This Row],[Show]] & \" Season Info'!C2:J15\"), 8,1)","v":"2009-10"}]
["The Office","Season 6",6,{"$f":"A189& \" S\" &C189","v":"The Office S6"},108,8,"\"Koi Pond\"","Reggie Hudlin","Warren Lieberstein & Halsted Sullivan","2009-10-29",{"$f":"CHOOSE(WEEKDAY(J189),\"Sun\",\"Mon\",\"Tue\",\"Wed\",\"Thu\",\"Fri\",\"Sat\")","v":"Thu"},"21:00:00",6009,8.1999999999999993,188,"Yes",{"$f":"VLOOKUP(EpisodeList[[#This Row],[Season Number]], INDIRECT(\"'\" & EpisodeList[[#This Row],[Show]] & \" Season Info'!C2:J15\"), 8,1)","v":"2009-10"}]
["30 Rock","Season 4",4,{"$f":"A190& \" S\" &C190","v":"30 Rock S4"},61,3,"\"Stone Mountain\"","Don Scardino","John Riggi","2009-10-29",{"$f":"CHOOSE(WEEKDAY(J190),\"Sun\",\"Mon\",\"Tue\",\"Wed\",\"Thu\",\"Fri\",\"Sat\")","v":"Thu"},"21:30:00",403,6.01,189,"Yes",{"$f":"VLOOKUP(EpisodeList[[#This Row],[Season Number]], INDIRECT(\"'\" & EpisodeList[[#This Row],[Show]] & \" Season Info'!C2:J15\"), 8,1)","v":"2009-10"}]
["Community","Season 1",1,{"$f":"A191& \" S\" &C191","v":"Community S1"},8,8,"\"Home Economics\"","Anthony Russo","Lauren Pomerantz","2009-11-05",{"$f":"CHOOSE(WEEKDAY(J191),\"Sun\",\"Mon\",\"Tue\",\"Wed\",\"Thu\",\"Fri\",\"Sat\")","v":"Thu"},"20:00:00",107,5.45,190,"Yes",{"$f":"VLOOKUP(EpisodeList[[#This Row],[Season Number]], INDIRECT(\"'\" & EpisodeList[[#This Row],[Show]] & \" Season Info'!C2:J15\"), 8,1)","v":"2009-10"}]
["Parks and Rec","Season 2",2,{"$f":"A192& \" S\" &C192","v":"Parks and Rec S2"},14,8,"\"Ron and Tammy\"","Troy Miller","Mike Scully","2009-11-05",{"$f":"CHOOSE(WEEKDAY(J192),\"Sun\",\"Mon\",\"Tue\",\"Wed\",\"Thu\",\"Fri\",\"Sat\")","v":"Thu"},"20:30:00",null,4.9400000000000004,191,"Yes",{"$f":"VLOOKUP(EpisodeList[[#This Row],[Season Number]], INDIRECT(\"'\" & EpisodeList[[#This Row],[Show]] & \" Season Info'!C2:J15\"), 8,1)","v":"2009-10"}]
["The Office","Season 6",6,{"$f":"A193& \" S\" &C193","v":"The Office S6"},109,9,"\"Double Date\"","Seth Gordon","Charlie Grandy","2009-11-05",{"$f":"CHOOSE(WEEKDAY(J193),\"Sun\",\"Mon\",\"Tue\",\"Wed\",\"Thu\",\"Fri\",\"Sat\")","v":"Thu"},"21:00:00",6008,7.94,192,"Yes",{"$f":"VLOOKUP(EpisodeList[[#This Row],[Season Number]], INDIRECT(\"'\" & EpisodeList[[#This Row],[Show]] & \" Season Info'!C2:J15\"), 8,1)","v":"2009-10"}]
["30 Rock","Season 4",4,{"$f":"A194& \" S\" &C194","v":"30 Rock S4"},62,4,"\"Audition Day\"","Beth McCarthy Miller","Matt Hubbard","2009-11-05",{"$f":"CHOOSE(WEEKDAY(J194),\"Sun\",\"Mon\",\"Tue\",\"Wed\",\"Thu\",\"Fri\",\"Sat\")","v":"Thu"},"21:30:00",404,6.15,193,{"$f":"IF(AND(\n    COUNTIFS(A:A, A194, J:J, J194) = 1,\n    COUNTIFS(A:A, \"30 Rock\", J:J, J194) = 1,\n    COUNTIFS(A:A, \"The Office\", J:J, J194) = 1,\n    COUNTIFS(A:A, \"Community\", J:J, J194) = 1,\n    COUNTIFS(A:A, \"Parks and Rec\", J:J, J194) = 1\n), \"Yes\", \"\")","v":"Yes"},{"$f":"VLOOKUP(EpisodeList[[#This Row],[Season Number]], INDIRECT(\"'\" & EpisodeList[[#This Row],[Show]] & \" Season Info'!C2:J15\"), 8,1)","v":"2009-10"}]
["Community","Season 1",1,{"$f":"A195& \" S\" &C195","v":"Community S1"},9,9,"\"Debate 109\"","Joe Russo","Tim Hobert","2009-11-12",{"$f":"CHOOSE(WEEKDAY(J195),\"Sun\",\"Mon\",\"Tue\",\"Wed\",\"Thu\",\"Fri\",\"Sat\")","v":"Thu"},"20:00:00",109,5.09,194,"Yes",{"$f":"VLOOKUP(EpisodeList[[#This Row],[Season Number]], INDIRECT(\"'\" & EpisodeList[[#This Row],[Show]] & \" Season Info'!C2:J15\"), 8,1)","v":"2009-10"}]
["Parks and Rec","Season 2",2,{"$f":"A196& \" S\" &C196","v":"Parks and Rec S2"},15,9,"\"The Camel\"","Millicent Shelton","Rachel Axler","2009-11-12",{"$f":"CHOOSE(WEEKDAY(J196),\"Sun\",\"Mon\",\"Tue\",\"Wed\",\"Thu\",\"Fri\",\"Sat\")","v":"Thu"},"20:30:00",null,4.67,195,"Yes",{"$f":"VLOOKUP(EpisodeList[[#This Row],[Season Number]], INDIRECT(\"'\" & EpisodeList[[#This Row],[Show]] & \" Season Info'!C2:J15\"), 8,1)","v":"2009-10"}]
["The Office","Season 6",6,{"$f":"A197& \" S\" &C197","v":"The Office S6"},110,10,"\"Murder\"","Greg Daniels","Daniel Chun","2009-11-12",{"$f":"CHOOSE(WEEKDAY(J197),\"Sun\",\"Mon\",\"Tue\",\"Wed\",\"Thu\",\"Fri\",\"Sat\")","v":"Thu"},"21:00:00",6010,7.76,196,"Yes",{"$f":"VLOOKUP(EpisodeList[[#This Row],[Season Number]], INDIRECT(\"'\" & EpisodeList[[#This Row],[Show]] & \" Season Info'!C2:J15\"), 8,1)","v":"2009-10"}]
["30 Rock","Season 4",4,{"$f":"A198& \" S\" &C198","v":"30 Rock S4"},63,5,"\"The Problem Solvers\"","John Riggi","Ron Weiner","2009-11-12",{"$f":"CHOOSE(WEEKDAY(J198),\"Sun\",\"Mon\",\"Tue\",\"Wed\",\"Thu\",\"Fri\",\"Sat\")","v":"Thu"},"21:30:00",405,6,197,"Yes",{"$f":"VLOOKUP(EpisodeList[[#This Row],[Season Number]], INDIRECT(\"'\" & EpisodeList[[#This Row],[Show]] & \" Season Info'!C2:J15\"), 8,1)","v":"2009-10"}]
["Community","Season 1",1,{"$f":"A199& \" S\" &C199","v":"Community S1"},10,10,"\"Environmental Science\"","Seth Gordon","Zach Paez","2009-11-19",{"$f":"CHOOSE(WEEKDAY(J199),\"Sun\",\"Mon\",\"Tue\",\"Wed\",\"Thu\",\"Fri\",\"Sat\")","v":"Thu"},"20:00:00",108,4.8600000000000003,198,"Yes",{"$f":"VLOOKUP(EpisodeList[[#This Row],[Season Number]], INDIRECT(\"'\" & EpisodeList[[#This Row],[Show]] & \" Season Info'!C2:J15\"), 8,1)","v":"2009-10"}]
["Parks and Rec","Season 2",2,{"$f":"A200& \" S\" &C200","v":"Parks and Rec S2"},16,10,"\"Hunting Trip\"","Greg Daniels","Dan Goor","2009-11-19",{"$f":"CHOOSE(WEEKDAY(J200),\"Sun\",\"Mon\",\"Tue\",\"Wed\",\"Thu\",\"Fri\",\"Sat\")","v":"Thu"},"20:30:00",null,4.6100000000000003,199,"Yes",{"$f":"VLOOKUP(EpisodeList[[#This Row],[Season Number]], INDIRECT(\"'\" & EpisodeList[[#This Row],[Show]] & \" Season Info'!C2:J15\"), 8,1)","v":"2009-10"}]
["The Office","Season 6",6,{"$f":"A201& \" S\" &C201","v":"The Office S6"},111,11,"\"Shareholder Meeting\"","Charles McDougall","Justin Spitzer","2009-11-19",{"$f":"CHOOSE(WEEKDAY(J201),\"Sun\",\"Mon\",\"Tue\",\"Wed\",\"Thu\",\"Fri\",\"Sat\")","v":"Thu"},"21:00:00",6011,7.43,200,"Yes",{"$f":"VLOOKUP(EpisodeList[[#This Row],[Season Number]], INDIRECT(\"'\" & EpisodeList[[#This Row],[Show]] & \" Season Info'!C2:J15\"), 8,1)","v":"2009-10"}]
["30 Rock","Season 4",4,{"$f":"A202& \" S\" &C202","v":"30 Rock S4"},64,6,"\"Sun Tea\"","Gail Mancuso","Josh Siegal & Dylan Morgan","2009-11-19",{"$f":"CHOOSE(WEEKDAY(J202),\"Sun\",\"Mon\",\"Tue\",\"Wed\",\"Thu\",\"Fri\",\"Sat\")","v":"Thu"},"21:30:00",406,5.72,201,"Yes",{"$f":"VLOOKUP(EpisodeList[[#This Row],[Season Number]], INDIRECT(\"'\" & EpisodeList[[#This Row],[Show]] & \" Season Info'!C2:J15\"), 8,1)","v":"2009-10"}]
["Community","Season 1",1,{"$f":"A203& \" S\" &C203","v":"Community S1"},11,11,"\"The Politics of Human Sexuality\"","Anthony Russo","Hilary Winston","2009-12-03",{"$f":"CHOOSE(WEEKDAY(J203),\"Sun\",\"Mon\",\"Tue\",\"Wed\",\"Thu\",\"Fri\",\"Sat\")","v":"Thu"},"20:00:00",110,5.42,202,"Yes",{"$f":"VLOOKUP(EpisodeList[[#This Row],[Season Number]], INDIRECT(\"'\" & EpisodeList[[#This Row],[Show]] & \" Season Info'!C2:J15\"), 8,1)","v":"2009-10"}]
["Parks and Rec","Season 2",2,{"$f":"A204& \" S\" &C204","v":"Parks and Rec S2"},17,11,"\"Tom's Divorce\"","Troy Miller","Harris Wittels","2009-12-03",{"$f":"CHOOSE(WEEKDAY(J204),\"Sun\",\"Mon\",\"Tue\",\"Wed\",\"Thu\",\"Fri\",\"Sat\")","v":"Thu"},"20:30:00",null,4.83,203,"Yes",{"$f":"VLOOKUP(EpisodeList[[#This Row],[Season Number]], INDIRECT(\"'\" & EpisodeList[[#This Row],[Show]] & \" Season Info'!C2:J15\"), 8,1)","v":"2009-10"}]
["The Office","Season 6",6,{"$f":"A205& \" S\" &C205","v":"The Office S6"},112,12,"\"Scott's Tots\"","B. J. Novak","Gene Stupnitsky & Lee Eisenberg","2009-12-03",{"$f":"CHOOSE(WEEKDAY(J205),\"Sun\",\"Mon\",\"Tue\",\"Wed\",\"Thu\",\"Fri\",\"Sat\")","v":"Thu"},"21:00:00",6013,8.1,204,"Yes",{"$f":"VLOOKUP(EpisodeList[[#This Row],[Season Number]], INDIRECT(\"'\" & EpisodeList[[#This Row],[Show]] & \" Season Info'!C2:J15\"), 8,1)","v":"2009-10"}]
["30 Rock","Season 4",4,{"$f":"A206& \" S\" &C206","v":"30 Rock S4"},65,7,"\"Dealbreakers Talk Show #0001\"","Don Scardino","Kay Cannon","2009-12-03",{"$f":"CHOOSE(WEEKDAY(J206),\"Sun\",\"Mon\",\"Tue\",\"Wed\",\"Thu\",\"Fri\",\"Sat\")","v":"Thu"},"21:30:00",407,6.08,205,"Yes",{"$f":"VLOOKUP(EpisodeList[[#This Row],[Season Number]], INDIRECT(\"'\" & EpisodeList[[#This Row],[Show]] & \" Season Info'!C2:J15\"), 8,1)","v":"2009-10"}]
["Community","Season 1",1,{"$f":"A207& \" S\" &C207","v":"Community S1"},12,12,"\"Comparative Religion\"","Adam Davidson","Liz Cackowski","2009-12-10",{"$f":"CHOOSE(WEEKDAY(J207),\"Sun\",\"Mon\",\"Tue\",\"Wed\",\"Thu\",\"Fri\",\"Sat\")","v":"Thu"},"20:00:00",111,5.51,206,"Yes",{"$f":"VLOOKUP(EpisodeList[[#This Row],[Season Number]], INDIRECT(\"'\" & EpisodeList[[#This Row],[Show]] & \" Season Info'!C2:J15\"), 8,1)","v":"2009-10"}]
["Parks and Rec","Season 2",2,{"$f":"A208& \" S\" &C208","v":"Parks and Rec S2"},18,12,"\"Christmas Scandal\"","Randall Einhorn","Michael Schur","2009-12-10",{"$f":"CHOOSE(WEEKDAY(J208),\"Sun\",\"Mon\",\"Tue\",\"Wed\",\"Thu\",\"Fri\",\"Sat\")","v":"Thu"},"20:30:00",null,4.9000000000000004,207,"Yes",{"$f":"VLOOKUP(EpisodeList[[#This Row],[Season Number]], INDIRECT(\"'\" & EpisodeList[[#This Row],[Show]] & \" Season Info'!C2:J15\"), 8,1)","v":"2009-10"}]
["The Office","Season 6",6,{"$f":"A209& \" S\" &C209","v":"The Office S6"},113,13,"\"Secret Santa\"","Randall Einhorn","Mindy Kaling","2009-12-10",{"$f":"CHOOSE(WEEKDAY(J209),\"Sun\",\"Mon\",\"Tue\",\"Wed\",\"Thu\",\"Fri\",\"Sat\")","v":"Thu"},"21:00:00",6014,8.51,208,"Yes",{"$f":"VLOOKUP(EpisodeList[[#This Row],[Season Number]], INDIRECT(\"'\" & EpisodeList[[#This Row],[Show]] & \" Season Info'!C2:J15\"), 8,1)","v":"2009-10"}]
["30 Rock","Season 4",4,{"$f":"A210& \" S\" &C210","v":"30 Rock S4"},66,8,"\"Secret Santa\"","Beth McCarthy Miller","Tina Fey","2009-12-10",{"$f":"CHOOSE(WEEKDAY(J210),\"Sun\",\"Mon\",\"Tue\",\"Wed\",\"Thu\",\"Fri\",\"Sat\")","v":"Thu"},"21:30:00",408,6.7,209,"Yes",{"$f":"VLOOKUP(EpisodeList[[#This Row],[Season Number]], INDIRECT(\"'\" & EpisodeList[[#This Row],[Show]] & \" Season Info'!C2:J15\"), 8,1)","v":"2009-10"}]
["Community","Season 1",1,{"$f":"A211& \" S\" &C211","v":"Community S1"},13,13,"\"Investigative Journalism\"","Joe Russo","Jon Pollack & Tim Hobert","2010-01-14",{"$f":"CHOOSE(WEEKDAY(J211),\"Sun\",\"Mon\",\"Tue\",\"Wed\",\"Thu\",\"Fri\",\"Sat\")","v":"Thu"},"20:00:00",113,5.42,210,"",{"$f":"VLOOKUP(EpisodeList[[#This Row],[Season Number]], INDIRECT(\"'\" & EpisodeList[[#This Row],[Show]] & \" Season Info'!C2:J15\"), 8,1)","v":"2009-10"}]
["Parks and Rec","Season 2",2,{"$f":"A212& \" S\" &C212","v":"Parks and Rec S2"},19,13,"\"The Set Up\"","Troy Miller","Katie Dippold","2010-01-14",{"$f":"CHOOSE(WEEKDAY(J212),\"Sun\",\"Mon\",\"Tue\",\"Wed\",\"Thu\",\"Fri\",\"Sat\")","v":"Thu"},"20:30:00",null,4.59,211,"",{"$f":"VLOOKUP(EpisodeList[[#This Row],[Season Number]], INDIRECT(\"'\" & EpisodeList[[#This Row],[Show]] & \" Season Info'!C2:J15\"), 8,1)","v":"2009-10"}]
["30 Rock","Season 4",4,{"$f":"A213& \" S\" &C213","v":"30 Rock S4"},67,9,"\"Klaus and Greta\"","Gail Mancuso","Robert Carlock","2010-01-14",{"$f":"CHOOSE(WEEKDAY(J213),\"Sun\",\"Mon\",\"Tue\",\"Wed\",\"Thu\",\"Fri\",\"Sat\")","v":"Thu"},"21:00:00",409,5.12,212,"",{"$f":"VLOOKUP(EpisodeList[[#This Row],[Season Number]], INDIRECT(\"'\" & EpisodeList[[#This Row],[Show]] & \" Season Info'!C2:J15\"), 8,1)","v":"2009-10"}]
["30 Rock","Season 4",4,{"$f":"A214& \" S\" &C214","v":"30 Rock S4"},68,10,"\"Black Light Attack!\"","Don Scardino","Steve Hely","2010-01-14",{"$f":"CHOOSE(WEEKDAY(J214),\"Sun\",\"Mon\",\"Tue\",\"Wed\",\"Thu\",\"Fri\",\"Sat\")","v":"Thu"},"21:30:00",410,5.01,213,"",{"$f":"VLOOKUP(EpisodeList[[#This Row],[Season Number]], INDIRECT(\"'\" & EpisodeList[[#This Row],[Show]] & \" Season Info'!C2:J15\"), 8,1)","v":"2009-10"}]
["Community","Season 1",1,{"$f":"A215& \" S\" &C215","v":"Community S1"},14,14,"\"Interpretive Dance\"","Justin Lin","Lauren Pomerantz","2010-01-21",{"$f":"CHOOSE(WEEKDAY(J215),\"Sun\",\"Mon\",\"Tue\",\"Wed\",\"Thu\",\"Fri\",\"Sat\")","v":"Thu"},"20:00:00",112,4.7300000000000004,214,"Yes",{"$f":"VLOOKUP(EpisodeList[[#This Row],[Season Number]], INDIRECT(\"'\" & EpisodeList[[#This Row],[Show]] & \" Season Info'!C2:J15\"), 8,1)","v":"2009-10"}]
["Parks and Rec","Season 2",2,{"$f":"A216& \" S\" &C216","v":"Parks and Rec S2"},20,14,"\"Leslie's House\"","Alex Hardcastle","Dan Goor","2010-01-21",{"$f":"CHOOSE(WEEKDAY(J216),\"Sun\",\"Mon\",\"Tue\",\"Wed\",\"Thu\",\"Fri\",\"Sat\")","v":"Thu"},"20:30:00",null,4.3499999999999996,215,"Yes",{"$f":"VLOOKUP(EpisodeList[[#This Row],[Season Number]], INDIRECT(\"'\" & EpisodeList[[#This Row],[Show]] & \" Season Info'!C2:J15\"), 8,1)","v":"2009-10"}]
["The Office","Season 6",6,{"$f":"A217& \" S\" &C217","v":"The Office S6"},114,14,"\"The Banker\"","Jeffrey Blitz","Jason Kessler","2010-01-21",{"$f":"CHOOSE(WEEKDAY(J217),\"Sun\",\"Mon\",\"Tue\",\"Wed\",\"Thu\",\"Fri\",\"Sat\")","v":"Thu"},"21:00:00",6012,7.29,216,"Yes",{"$f":"VLOOKUP(EpisodeList[[#This Row],[Season Number]], INDIRECT(\"'\" & EpisodeList[[#This Row],[Show]] & \" Season Info'!C2:J15\"), 8,1)","v":"2009-10"}]
["30 Rock","Season 4",4,{"$f":"A218& \" S\" &C218","v":"30 Rock S4"},69,11,"\"Winter Madness\"","Beth McCarthy Miller","Vali Chandrasekaran & Tom Ceraulo","2010-01-21",{"$f":"CHOOSE(WEEKDAY(J218),\"Sun\",\"Mon\",\"Tue\",\"Wed\",\"Thu\",\"Fri\",\"Sat\")","v":"Thu"},"21:30:00",411,5.58,217,"Yes",{"$f":"VLOOKUP(EpisodeList[[#This Row],[Season Number]], INDIRECT(\"'\" & EpisodeList[[#This Row],[Show]] & \" Season Info'!C2:J15\"), 8,1)","v":"2009-10"}]
["Community","Season 1",1,{"$f":"A219& \" S\" &C219","v":"Community S1"},15,15,"\"Romantic Expressionism\"","Joe Russo","Andrew Guest","2010-02-04",{"$f":"CHOOSE(WEEKDAY(J219),\"Sun\",\"Mon\",\"Tue\",\"Wed\",\"Thu\",\"Fri\",\"Sat\")","v":"Thu"},"20:00:00",115,5.23,218,"Yes",{"$f":"VLOOKUP(EpisodeList[[#This Row],[Season Number]], INDIRECT(\"'\" & EpisodeList[[#This Row],[Show]] & \" Season Info'!C2:J15\"), 8,1)","v":"2009-10"}]
["Parks and Rec","Season 2",2,{"$f":"A220& \" S\" &C220","v":"Parks and Rec S2"},21,15,"\"Sweetums\"","Dean Holland","Alan Yang","2010-02-04",{"$f":"CHOOSE(WEEKDAY(J220),\"Sun\",\"Mon\",\"Tue\",\"Wed\",\"Thu\",\"Fri\",\"Sat\")","v":"Thu"},"20:30:00",null,4.87,219,"Yes",{"$f":"VLOOKUP(EpisodeList[[#This Row],[Season Number]], INDIRECT(\"'\" & EpisodeList[[#This Row],[Show]] & \" Season Info'!C2:J15\"), 8,1)","v":"2009-10"}]
["The Office","Season 6",6,{"$f":"A221& \" S\" &C221","v":"The Office S6"},115,15,"\"Sabre\"","John Krasinski","Jennifer Celotta","2010-02-04",{"$f":"CHOOSE(WEEKDAY(J221),\"Sun\",\"Mon\",\"Tue\",\"Wed\",\"Thu\",\"Fri\",\"Sat\")","v":"Thu"},"21:00:00",6015,7.36,220,"Yes",{"$f":"VLOOKUP(EpisodeList[[#This Row],[Season Number]], INDIRECT(\"'\" & EpisodeList[[#This Row],[Show]] & \" Season Info'!C2:J15\"), 8,1)","v":"2009-10"}]
["30 Rock","Season 4",4,{"$f":"A222& \" S\" &C222","v":"30 Rock S4"},70,12,"\"Verna\"","Don Scardino","Ron Weiner","2010-02-04",{"$f":"CHOOSE(WEEKDAY(J222),\"Sun\",\"Mon\",\"Tue\",\"Wed\",\"Thu\",\"Fri\",\"Sat\")","v":"Thu"},"21:30:00",412,5.79,221,"Yes",{"$f":"VLOOKUP(EpisodeList[[#This Row],[Season Number]], INDIRECT(\"'\" & EpisodeList[[#This Row],[Show]] & \" Season Info'!C2:J15\"), 8,1)","v":"2009-10"}]
["Community","Season 1",1,{"$f":"A223& \" S\" &C223","v":"Community S1"},16,16,"\"Communication Studies\"","Adam Davidson","Chris McKenna","2010-02-11",{"$f":"CHOOSE(WEEKDAY(J223),\"Sun\",\"Mon\",\"Tue\",\"Wed\",\"Thu\",\"Fri\",\"Sat\")","v":"Thu"},"20:00:00",116,5.15,222,"Yes",{"$f":"VLOOKUP(EpisodeList[[#This Row],[Season Number]], INDIRECT(\"'\" & EpisodeList[[#This Row],[Show]] & \" Season Info'!C2:J15\"), 8,1)","v":"2009-10"}]
["Parks and Rec","Season 2",2,{"$f":"A224& \" S\" &C224","v":"Parks and Rec S2"},22,16,"\"Galentine's Day\"","Ken Kwapis","Michael Schur","2010-02-11",{"$f":"CHOOSE(WEEKDAY(J224),\"Sun\",\"Mon\",\"Tue\",\"Wed\",\"Thu\",\"Fri\",\"Sat\")","v":"Thu"},"20:30:00",null,4.9800000000000004,223,"Yes",{"$f":"VLOOKUP(EpisodeList[[#This Row],[Season Number]], INDIRECT(\"'\" & EpisodeList[[#This Row],[Show]] & \" Season Info'!C2:J15\"), 8,1)","v":"2009-10"}]
["The Office","Season 6",6,{"$f":"A225& \" S\" &C225","v":"The Office S6"},116,16,"\"The Manager and the Salesman\"","Marc Webb","Mindy Kaling","2010-02-11",{"$f":"CHOOSE(WEEKDAY(J225),\"Sun\",\"Mon\",\"Tue\",\"Wed\",\"Thu\",\"Fri\",\"Sat\")","v":"Thu"},"21:00:00",6016,7.4,224,"Yes",{"$f":"VLOOKUP(EpisodeList[[#This Row],[Season Number]], INDIRECT(\"'\" & EpisodeList[[#This Row],[Show]] & \" Season Info'!C2:J15\"), 8,1)","v":"2009-10"}]
["30 Rock","Season 4",4,{"$f":"A226& \" S\" &C226","v":"30 Rock S4"},71,13,"\"Anna Howard Shaw Day\"","Ken Whittingham","Matt Hubbard","2010-02-11",{"$f":"CHOOSE(WEEKDAY(J226),\"Sun\",\"Mon\",\"Tue\",\"Wed\",\"Thu\",\"Fri\",\"Sat\")","v":"Thu"},"21:30:00",413,6,225,"Yes",{"$f":"VLOOKUP(EpisodeList[[#This Row],[Season Number]], INDIRECT(\"'\" & EpisodeList[[#This Row],[Show]] & \" Season Info'!C2:J15\"), 8,1)","v":"2009-10"}]
["Community","Season 1",1,{"$f":"A227& \" S\" &C227","v":"Community S1"},17,17,"\"Physical Education\"","Anthony Russo","Jessie Miller","2010-03-04",{"$f":"CHOOSE(WEEKDAY(J227),\"Sun\",\"Mon\",\"Tue\",\"Wed\",\"Thu\",\"Fri\",\"Sat\")","v":"Thu"},"20:00:00",118,5.0599999999999996,226,"",{"$f":"VLOOKUP(EpisodeList[[#This Row],[Season Number]], INDIRECT(\"'\" & EpisodeList[[#This Row],[Show]] & \" Season Info'!C2:J15\"), 8,1)","v":"2009-10"}]
["Parks and Rec","Season 2",2,{"$f":"A228& \" S\" &C228","v":"Parks and Rec S2"},23,17,"\"Woman of the Year\"","Jason Woliner","Norm Hiscock","2010-03-04",{"$f":"CHOOSE(WEEKDAY(J228),\"Sun\",\"Mon\",\"Tue\",\"Wed\",\"Thu\",\"Fri\",\"Sat\")","v":"Thu"},"20:30:00",null,4.6399999999999997,227,"",{"$f":"VLOOKUP(EpisodeList[[#This Row],[Season Number]], INDIRECT(\"'\" & EpisodeList[[#This Row],[Show]] & \" Season Info'!C2:J15\"), 8,1)","v":"2009-10"}]
["The Office","Season 6",6,{"$f":"A229& \" S\" &C229","v":"The Office S6"},117,17,"\"The Delivery\"","Seth Gordon Harold Ramis","Daniel Chun Charlie Grandy","2010-03-04",{"$f":"CHOOSE(WEEKDAY(J229),\"Sun\",\"Mon\",\"Tue\",\"Wed\",\"Thu\",\"Fri\",\"Sat\")","v":"Thu"},"21:00:00",6018,9,228,"",{"$f":"VLOOKUP(EpisodeList[[#This Row],[Season Number]], INDIRECT(\"'\" & EpisodeList[[#This Row],[Show]] & \" Season Info'!C2:J15\"), 8,1)","v":"2009-10"}]
["The Office","Season 6",6,{"$f":"A230& \" S\" &C230","v":"The Office S6"},118,18,"\"The Delivery\"","Seth Gordon Harold Ramis","Daniel Chun Charlie Grandy","2010-03-04",{"$f":"CHOOSE(WEEKDAY(J230),\"Sun\",\"Mon\",\"Tue\",\"Wed\",\"Thu\",\"Fri\",\"Sat\")","v":"Thu"},"21:30:00",6019,9,229,"",{"$f":"VLOOKUP(EpisodeList[[#This Row],[Season Number]], INDIRECT(\"'\" & EpisodeList[[#This Row],[Show]] & \" Season Info'!C2:J15\"), 8,1)","v":"2009-10"}]
["Community","Season 1",1,{"$f":"A231& \" S\" &C231","v":"Community S1"},18,18,"\"Basic Genealogy\"","Ken Whittingham","Karey Dornetto","2010-03-11",{"$f":"CHOOSE(WEEKDAY(J231),\"Sun\",\"Mon\",\"Tue\",\"Wed\",\"Thu\",\"Fri\",\"Sat\")","v":"Thu"},"20:00:00",117,4.7,230,"Yes",{"$f":"VLOOKUP(EpisodeList[[#This Row],[Season Number]], INDIRECT(\"'\" & EpisodeList[[#This Row],[Show]] & \" Season Info'!C2:J15\"), 8,1)","v":"2009-10"}]
["Parks and Rec","Season 2",2,{"$f":"A232& \" S\" &C232","v":"Parks and Rec S2"},24,18,"\"The Possum\"","Tristram Shapeero","Mike Scully","2010-03-11",{"$f":"CHOOSE(WEEKDAY(J232),\"Sun\",\"Mon\",\"Tue\",\"Wed\",\"Thu\",\"Fri\",\"Sat\")","v":"Thu"},"20:30:00",null,4.6100000000000003,231,"Yes",{"$f":"VLOOKUP(EpisodeList[[#This Row],[Season Number]], INDIRECT(\"'\" & EpisodeList[[#This Row],[Show]] & \" Season Info'!C2:J15\"), 8,1)","v":"2009-10"}]
["The Office","Season 6",6,{"$f":"A233& \" S\" &C233","v":"The Office S6"},119,19,"\"St. Patrick's Day\"","Randall Einhorn","Jonathan Hughes","2010-03-11",{"$f":"CHOOSE(WEEKDAY(J233),\"Sun\",\"Mon\",\"Tue\",\"Wed\",\"Thu\",\"Fri\",\"Sat\")","v":"Thu"},"21:00:00",6017,7.51,232,"Yes",{"$f":"VLOOKUP(EpisodeList[[#This Row],[Season Number]], INDIRECT(\"'\" & EpisodeList[[#This Row],[Show]] & \" Season Info'!C2:J15\"), 8,1)","v":"2009-10"}]
["30 Rock","Season 4",4,{"$f":"A234& \" S\" &C234","v":"30 Rock S4"},72,14,"\"Future Husband\"","Don Scardino","Tracey Wigfield & Jon Haller","2010-03-11",{"$f":"CHOOSE(WEEKDAY(J234),\"Sun\",\"Mon\",\"Tue\",\"Wed\",\"Thu\",\"Fri\",\"Sat\")","v":"Thu"},"21:30:00",414,5.89,233,"Yes",{"$f":"VLOOKUP(EpisodeList[[#This Row],[Season Number]], INDIRECT(\"'\" & EpisodeList[[#This Row],[Show]] & \" Season Info'!C2:J15\"), 8,1)","v":"2009-10"}]
["Community","Season 1",1,{"$f":"A235& \" S\" &C235","v":"Community S1"},19,19,"\"Beginner Pottery\"","Anthony Russo","Hilary Winston","2010-03-18",{"$f":"CHOOSE(WEEKDAY(J235),\"Sun\",\"Mon\",\"Tue\",\"Wed\",\"Thu\",\"Fri\",\"Sat\")","v":"Thu"},"20:00:00",114,5.21,234,"Yes",{"$f":"VLOOKUP(EpisodeList[[#This Row],[Season Number]], INDIRECT(\"'\" & EpisodeList[[#This Row],[Show]] & \" Season Info'!C2:J15\"), 8,1)","v":"2009-10"}]
["Parks and Rec","Season 2",2,{"$f":"A236& \" S\" &C236","v":"Parks and Rec S2"},25,19,"\"Park Safety\"","Michael Trim","Aisha Muharrar","2010-03-18",{"$f":"CHOOSE(WEEKDAY(J236),\"Sun\",\"Mon\",\"Tue\",\"Wed\",\"Thu\",\"Fri\",\"Sat\")","v":"Thu"},"20:30:00",null,4.7,235,"Yes",{"$f":"VLOOKUP(EpisodeList[[#This Row],[Season Number]], INDIRECT(\"'\" & EpisodeList[[#This Row],[Show]] & \" Season Info'!C2:J15\"), 8,1)","v":"2009-10"}]
["The Office","Season 6",6,{"$f":"A237& \" S\" &C237","v":"The Office S6"},120,20,"\"New Leads\"","Brent Forrester","Brent Forrester","2010-03-18",{"$f":"CHOOSE(WEEKDAY(J237),\"Sun\",\"Mon\",\"Tue\",\"Wed\",\"Thu\",\"Fri\",\"Sat\")","v":"Thu"},"21:00:00",6020,7.63,236,"Yes",{"$f":"VLOOKUP(EpisodeList[[#This Row],[Season Number]], INDIRECT(\"'\" & EpisodeList[[#This Row],[Show]] & \" Season Info'!C2:J15\"), 8,1)","v":"2009-10"}]
["30 Rock","Season 4",4,{"$f":"A238& \" S\" &C238","v":"30 Rock S4"},73,15,"\"Don Geiss, America and Hope\"","Stephen Lee Davis","Jack Burditt & Tracey Wigfield","2010-03-18",{"$f":"CHOOSE(WEEKDAY(J238),\"Sun\",\"Mon\",\"Tue\",\"Wed\",\"Thu\",\"Fri\",\"Sat\")","v":"Thu"},"21:30:00",415,6.79,237,"Yes",{"$f":"VLOOKUP(EpisodeList[[#This Row],[Season Number]], INDIRECT(\"'\" & EpisodeList[[#This Row],[Show]] & \" Season Info'!C2:J15\"), 8,1)","v":"2009-10"}]
["Community","Season 1",1,{"$f":"A239& \" S\" &C239","v":"Community S1"},20,20,"\"The Science of Illusion\"","Adam Davidson","Zach Paez","2010-03-25",{"$f":"CHOOSE(WEEKDAY(J239),\"Sun\",\"Mon\",\"Tue\",\"Wed\",\"Thu\",\"Fri\",\"Sat\")","v":"Thu"},"20:00:00",122,5.07,238,"Yes",{"$f":"VLOOKUP(EpisodeList[[#This Row],[Season Number]], INDIRECT(\"'\" & EpisodeList[[#This Row],[Show]] & \" Season Info'!C2:J15\"), 8,1)","v":"2009-10"}]
["Parks and Rec","Season 2",2,{"$f":"A240& \" S\" &C240","v":"Parks and Rec S2"},26,20,"\"Summer Catalog\"","Ken Whittingham","Katie Dippold","2010-03-25",{"$f":"CHOOSE(WEEKDAY(J240),\"Sun\",\"Mon\",\"Tue\",\"Wed\",\"Thu\",\"Fri\",\"Sat\")","v":"Thu"},"20:30:00",null,4.49,239,"Yes",{"$f":"VLOOKUP(EpisodeList[[#This Row],[Season Number]], INDIRECT(\"'\" & EpisodeList[[#This Row],[Show]] & \" Season Info'!C2:J15\"), 8,1)","v":"2009-10"}]
["The Office","Season 6",6,{"$f":"A241& \" S\" &C241","v":"The Office S6"},121,21,"\"Happy Hour\"","Matt Sohn","B. J. Novak","2010-03-25",{"$f":"CHOOSE(WEEKDAY(J241),\"Sun\",\"Mon\",\"Tue\",\"Wed\",\"Thu\",\"Fri\",\"Sat\")","v":"Thu"},"21:00:00",6021,7.17,240,"Yes",{"$f":"VLOOKUP(EpisodeList[[#This Row],[Season Number]], INDIRECT(\"'\" & EpisodeList[[#This Row],[Show]] & \" Season Info'!C2:J15\"), 8,1)","v":"2009-10"}]
["30 Rock","Season 4",4,{"$f":"A242& \" S\" &C242","v":"30 Rock S4"},74,16,"\"Floyd\"","Millicent Shelton","Paula Pell","2010-03-25",{"$f":"CHOOSE(WEEKDAY(J242),\"Sun\",\"Mon\",\"Tue\",\"Wed\",\"Thu\",\"Fri\",\"Sat\")","v":"Thu"},"21:30:00",416,6.25,241,"Yes",{"$f":"VLOOKUP(EpisodeList[[#This Row],[Season Number]], INDIRECT(\"'\" & EpisodeList[[#This Row],[Show]] & \" Season Info'!C2:J15\"), 8,1)","v":"2009-10"}]
["Community","Season 1",1,{"$f":"A243& \" S\" &C243","v":"Community S1"},21,21,"\"Contemporary American Poultry\"","Tristram Shapeero","Emily Cutler & Karey Dornetto","2010-04-22",{"$f":"CHOOSE(WEEKDAY(J243),\"Sun\",\"Mon\",\"Tue\",\"Wed\",\"Thu\",\"Fri\",\"Sat\")","v":"Thu"},"20:00:00",123,3.67,242,"",{"$f":"VLOOKUP(EpisodeList[[#This Row],[Season Number]], INDIRECT(\"'\" & EpisodeList[[#This Row],[Show]] & \" Season Info'!C2:J15\"), 8,1)","v":"2009-10"}]
["30 Rock","Season 4",4,{"$f":"A244& \" S\" &C244","v":"30 Rock S4"},75,17,"\"Lee Marvin vs. Derek Jeter\"","Don Scardino","Kay Cannon & Tina Fey","2010-04-22",{"$f":"CHOOSE(WEEKDAY(J244),\"Sun\",\"Mon\",\"Tue\",\"Wed\",\"Thu\",\"Fri\",\"Sat\")","v":"Thu"},"20:30:00",417,4,243,"",{"$f":"VLOOKUP(EpisodeList[[#This Row],[Season Number]], INDIRECT(\"'\" & EpisodeList[[#This Row],[Show]] & \" Season Info'!C2:J15\"), 8,1)","v":"2009-10"}]
["30 Rock","Season 4",4,{"$f":"A245& \" S\" &C245","v":"30 Rock S4"},76,18,"\"Khonani\"","Beth McCarthy Miller","Vali Chandrasekaran","2010-04-22",{"$f":"CHOOSE(WEEKDAY(J245),\"Sun\",\"Mon\",\"Tue\",\"Wed\",\"Thu\",\"Fri\",\"Sat\")","v":"Thu"},"21:00:00",418,5.16,244,"",{"$f":"VLOOKUP(EpisodeList[[#This Row],[Season Number]], INDIRECT(\"'\" & EpisodeList[[#This Row],[Show]] & \" Season Info'!C2:J15\"), 8,1)","v":"2009-10"}]
["The Office","Season 6",6,{"$f":"A246& \" S\" &C246","v":"The Office S6"},122,22,"\"Secretary's Day\"","Steve Carell","Mindy Kaling","2010-04-22",{"$f":"CHOOSE(WEEKDAY(J246),\"Sun\",\"Mon\",\"Tue\",\"Wed\",\"Thu\",\"Fri\",\"Sat\")","v":"Thu"},"21:00:00",6022,6.3,245,"",{"$f":"VLOOKUP(EpisodeList[[#This Row],[Season Number]], INDIRECT(\"'\" & EpisodeList[[#This Row],[Show]] & \" Season Info'!C2:J15\"), 8,1)","v":"2009-10"}]
["Community","Season 1",1,{"$f":"A247& \" S\" &C247","v":"Community S1"},22,22,"\"The Art of Discourse\"","Adam Davidson","Chris McKenna","2010-04-29",{"$f":"CHOOSE(WEEKDAY(J247),\"Sun\",\"Mon\",\"Tue\",\"Wed\",\"Thu\",\"Fri\",\"Sat\")","v":"Thu"},"20:00:00",124,4.3600000000000003,246,"Yes",{"$f":"VLOOKUP(EpisodeList[[#This Row],[Season Number]], INDIRECT(\"'\" & EpisodeList[[#This Row],[Show]] & \" Season Info'!C2:J15\"), 8,1)","v":"2009-10"}]
["Parks and Rec","Season 2",2,{"$f":"A248& \" S\" &C248","v":"Parks and Rec S2"},27,21,"\"94 Meetings\"","Tristram Shapeero","Harris Wittels","2010-04-29",{"$f":"CHOOSE(WEEKDAY(J248),\"Sun\",\"Mon\",\"Tue\",\"Wed\",\"Thu\",\"Fri\",\"Sat\")","v":"Thu"},"20:30:00",null,4.03,247,"Yes",{"$f":"VLOOKUP(EpisodeList[[#This Row],[Season Number]], INDIRECT(\"'\" & EpisodeList[[#This Row],[Show]] & \" Season Info'!C2:J15\"), 8,1)","v":"2009-10"}]
["The Office","Season 6",6,{"$f":"A249& \" S\" &C249","v":"The Office S6"},123,23,"\"Body Language\"","Mindy Kaling","Justin Spitzer","2010-04-29",{"$f":"CHOOSE(WEEKDAY(J249),\"Sun\",\"Mon\",\"Tue\",\"Wed\",\"Thu\",\"Fri\",\"Sat\")","v":"Thu"},"21:00:00",6023,7.01,248,"Yes",{"$f":"VLOOKUP(EpisodeList[[#This Row],[Season Number]], INDIRECT(\"'\" & EpisodeList[[#This Row],[Show]] & \" Season Info'!C2:J15\"), 8,1)","v":"2009-10"}]
["30 Rock","Season 4",4,{"$f":"A250& \" S\" &C250","v":"30 Rock S4"},77,19,"\"Argus\"","Jeff Richmond","Josh Siegal, Dylan Morgan & Paula Pell","2010-04-29",{"$f":"CHOOSE(WEEKDAY(J250),\"Sun\",\"Mon\",\"Tue\",\"Wed\",\"Thu\",\"Fri\",\"Sat\")","v":"Thu"},"21:30:00",419,5.44,249,"Yes",{"$f":"VLOOKUP(EpisodeList[[#This Row],[Season Number]], INDIRECT(\"'\" & EpisodeList[[#This Row],[Show]] & \" Season Info'!C2:J15\"), 8,1)","v":"2009-10"}]
["Community","Season 1",1,{"$f":"A251& \" S\" &C251","v":"Community S1"},23,23,"\"Modern Warfare\"","Justin Lin","Emily Cutler","2010-05-06",{"$f":"CHOOSE(WEEKDAY(J251),\"Sun\",\"Mon\",\"Tue\",\"Wed\",\"Thu\",\"Fri\",\"Sat\")","v":"Thu"},"20:00:00",119,4.3499999999999996,250,"Yes",{"$f":"VLOOKUP(EpisodeList[[#This Row],[Season Number]], INDIRECT(\"'\" & EpisodeList[[#This Row],[Show]] & \" Season Info'!C2:J15\"), 8,1)","v":"2009-10"}]
["Parks and Rec","Season 2",2,{"$f":"A252& \" S\" &C252","v":"Parks and Rec S2"},28,22,"\"Telethon\"","Troy Miller","Amy Poehler","2010-05-06",{"$f":"CHOOSE(WEEKDAY(J252),\"Sun\",\"Mon\",\"Tue\",\"Wed\",\"Thu\",\"Fri\",\"Sat\")","v":"Thu"},"20:30:00",null,4.03,251,"Yes",{"$f":"VLOOKUP(EpisodeList[[#This Row],[Season Number]], INDIRECT(\"'\" & EpisodeList[[#This Row],[Show]] & \" Season Info'!C2:J15\"), 8,1)","v":"2009-10"}]
["The Office","Season 6",6,{"$f":"A253& \" S\" &C253","v":"The Office S6"},124,24,"\"The Cover-Up\"","Rainn Wilson","Gene Stupnitsky & Lee Eisenberg","2010-05-06",{"$f":"CHOOSE(WEEKDAY(J253),\"Sun\",\"Mon\",\"Tue\",\"Wed\",\"Thu\",\"Fri\",\"Sat\")","v":"Thu"},"21:00:00",6024,6.84,252,"Yes",{"$f":"VLOOKUP(EpisodeList[[#This Row],[Season Number]], INDIRECT(\"'\" & EpisodeList[[#This Row],[Show]] & \" Season Info'!C2:J15\"), 8,1)","v":"2009-10"}]
["30 Rock","Season 4",4,{"$f":"A254& \" S\" &C254","v":"30 Rock S4"},78,20,"\"The Moms\"","John Riggi","Kay Cannon & Robert Carlock","2010-05-06",{"$f":"CHOOSE(WEEKDAY(J254),\"Sun\",\"Mon\",\"Tue\",\"Wed\",\"Thu\",\"Fri\",\"Sat\")","v":"Thu"},"21:30:00",420,5.42,253,"Yes",{"$f":"VLOOKUP(EpisodeList[[#This Row],[Season Number]], INDIRECT(\"'\" & EpisodeList[[#This Row],[Show]] & \" Season Info'!C2:J15\"), 8,1)","v":"2009-10"}]
["Community","Season 1",1,{"$f":"A255& \" S\" &C255","v":"Community S1"},24,24,"\"English as a Second Language\"","Gail Mancuso","Tim Hobert","2010-05-13",{"$f":"CHOOSE(WEEKDAY(J255),\"Sun\",\"Mon\",\"Tue\",\"Wed\",\"Thu\",\"Fri\",\"Sat\")","v":"Thu"},"20:00:00",120,4.49,254,"Yes",{"$f":"VLOOKUP(EpisodeList[[#This Row],[Season Number]], INDIRECT(\"'\" & EpisodeList[[#This Row],[Show]] & \" Season Info'!C2:J15\"), 8,1)","v":"2009-10"}]
["Parks and Rec","Season 2",2,{"$f":"A256& \" S\" &C256","v":"Parks and Rec S2"},29,23,"\"The Master Plan\"","Dean Holland","Michael Schur","2010-05-13",{"$f":"CHOOSE(WEEKDAY(J256),\"Sun\",\"Mon\",\"Tue\",\"Wed\",\"Thu\",\"Fri\",\"Sat\")","v":"Thu"},"20:30:00",null,4.28,255,"Yes",{"$f":"VLOOKUP(EpisodeList[[#This Row],[Season Number]], INDIRECT(\"'\" & EpisodeList[[#This Row],[Show]] & \" Season Info'!C2:J15\"), 8,1)","v":"2009-10"}]
["The Office","Season 6",6,{"$f":"A257& \" S\" &C257","v":"The Office S6"},125,25,"\"The Chump\"","Randall Einhorn","Aaron Shure","2010-05-13",{"$f":"CHOOSE(WEEKDAY(J257),\"Sun\",\"Mon\",\"Tue\",\"Wed\",\"Thu\",\"Fri\",\"Sat\")","v":"Thu"},"21:00:00",6025,6.6,256,"Yes",{"$f":"VLOOKUP(EpisodeList[[#This Row],[Season Number]], INDIRECT(\"'\" & EpisodeList[[#This Row],[Show]] & \" Season Info'!C2:J15\"), 8,1)","v":"2009-10"}]
["30 Rock","Season 4",4,{"$f":"A258& \" S\" &C258","v":"30 Rock S4"},79,21,"\"Emanuelle Goes to Dinosaur Land\"","Beth McCarthy Miller","Matt Hubbard","2010-05-13",{"$f":"CHOOSE(WEEKDAY(J258),\"Sun\",\"Mon\",\"Tue\",\"Wed\",\"Thu\",\"Fri\",\"Sat\")","v":"Thu"},"21:30:00",421,4.96,257,{"$f":"IF(AND(\n    COUNTIFS(A:A, A258, J:J, J258) = 1,\n    COUNTIFS(A:A, \"30 Rock\", J:J, J258) = 1,\n    COUNTIFS(A:A, \"The Office\", J:J, J258) = 1,\n    COUNTIFS(A:A, \"Community\", J:J, J258) = 1,\n    COUNTIFS(A:A, \"Parks and Rec\", J:J, J258) = 1\n), \"Yes\", \"\")","v":"Yes"},{"$f":"VLOOKUP(EpisodeList[[#This Row],[Season Number]], INDIRECT(\"'\" & EpisodeList[[#This Row],[Show]] & \" Season Info'!C2:J15\"), 8,1)","v":"2009-10"}]
["Community","Season 1",1,{"$f":"A259& \" S\" &C259","v":"Community S1"},25,25,"\"Pascal's Triangle Revisited\"","Joe Russo","Hilary Winston","2010-05-20",{"$f":"CHOOSE(WEEKDAY(J259),\"Sun\",\"Mon\",\"Tue\",\"Wed\",\"Thu\",\"Fri\",\"Sat\")","v":"Thu"},"20:00:00",121,4.41,258,"Yes",{"$f":"VLOOKUP(EpisodeList[[#This Row],[Season Number]], INDIRECT(\"'\" & EpisodeList[[#This Row],[Show]] & \" Season Info'!C2:J15\"), 8,1)","v":"2009-10"}]
["Parks and Rec","Season 2",2,{"$f":"A260& \" S\" &C260","v":"Parks and Rec S2"},30,24,"\"Freddy Spaghetti\"","Jason Woliner","Dan Goor","2010-05-20",{"$f":"CHOOSE(WEEKDAY(J260),\"Sun\",\"Mon\",\"Tue\",\"Wed\",\"Thu\",\"Fri\",\"Sat\")","v":"Thu"},"20:30:00",null,4.55,259,"Yes",{"$f":"VLOOKUP(EpisodeList[[#This Row],[Season Number]], INDIRECT(\"'\" & EpisodeList[[#This Row],[Show]] & \" Season Info'!C2:J15\"), 8,1)","v":"2009-10"}]
["The Office","Season 6",6,{"$f":"A261& \" S\" &C261","v":"The Office S6"},126,26,"\"Whistleblower\"","Paul Lieberstein","Warren Lieberstein & Halsted Sullivan","2010-05-20",{"$f":"CHOOSE(WEEKDAY(J261),\"Sun\",\"Mon\",\"Tue\",\"Wed\",\"Thu\",\"Fri\",\"Sat\")","v":"Thu"},"21:00:00",6026,6.6,260,"Yes",{"$f":"VLOOKUP(EpisodeList[[#This Row],[Season Number]], INDIRECT(\"'\" & EpisodeList[[#This Row],[Show]] & \" Season Info'!C2:J15\"), 8,1)","v":"2009-10"}]
["30 Rock","Season 4",4,{"$f":"A262& \" S\" &C262","v":"30 Rock S4"},80,22,"\"I Do Do\"","Don Scardino","Tina Fey","2010-05-20",{"$f":"CHOOSE(WEEKDAY(J262),\"Sun\",\"Mon\",\"Tue\",\"Wed\",\"Thu\",\"Fri\",\"Sat\")","v":"Thu"},"21:30:00",422,5.45,261,"Yes",{"$f":"VLOOKUP(EpisodeList[[#This Row],[Season Number]], INDIRECT(\"'\" & EpisodeList[[#This Row],[Show]] & \" Season Info'!C2:J15\"), 8,1)","v":"2009-10"}]
["Community","Season 2",2,{"$f":"A263& \" S\" &C263","v":"Community S2"},26,1,"\"Anthropology 101\"","Joe Russo","Chris McKenna","2010-09-23",{"$f":"CHOOSE(WEEKDAY(J263),\"Sun\",\"Mon\",\"Tue\",\"Wed\",\"Thu\",\"Fri\",\"Sat\")","v":"Thu"},"20:00:00",201,5.01,262,"",{"$f":"VLOOKUP(EpisodeList[[#This Row],[Season Number]], INDIRECT(\"'\" & EpisodeList[[#This Row],[Show]] & \" Season Info'!C2:J15\"), 8,1)","v":"2010-11"}]
["30 Rock","Season 5",5,{"$f":"A264& \" S\" &C264","v":"30 Rock S5"},81,1,"\"The Fabian Strategy\"","Beth McCarthy-Miller","Tina Fey","2010-09-23",{"$f":"CHOOSE(WEEKDAY(J264),\"Sun\",\"Mon\",\"Tue\",\"Wed\",\"Thu\",\"Fri\",\"Sat\")","v":"Thu"},"20:30:00",501,5.85,263,"",{"$f":"VLOOKUP(EpisodeList[[#This Row],[Season Number]], INDIRECT(\"'\" & EpisodeList[[#This Row],[Show]] & \" Season Info'!C2:J15\"), 8,1)","v":"2010-11"}]
["The Office","Season 7",7,{"$f":"A265& \" S\" &C265","v":"The Office S7"},127,1,"\"Nepotism\"","Jeffrey Blitz","Daniel Chun","2010-09-23",{"$f":"CHOOSE(WEEKDAY(J265),\"Sun\",\"Mon\",\"Tue\",\"Wed\",\"Thu\",\"Fri\",\"Sat\")","v":"Thu"},"21:00:00",7001,8.4,264,"",{"$f":"VLOOKUP(EpisodeList[[#This Row],[Season Number]], INDIRECT(\"'\" & EpisodeList[[#This Row],[Show]] & \" Season Info'!C2:J15\"), 8,1)","v":"2010-11"}]
["Community","Season 2",2,{"$f":"A266& \" S\" &C266","v":"Community S2"},27,2,"\"Accounting for Lawyers\"","Joe Russo","Emily Cutler","2010-09-30",{"$f":"CHOOSE(WEEKDAY(J266),\"Sun\",\"Mon\",\"Tue\",\"Wed\",\"Thu\",\"Fri\",\"Sat\")","v":"Thu"},"20:00:00",203,4.53,265,"",{"$f":"VLOOKUP(EpisodeList[[#This Row],[Season Number]], INDIRECT(\"'\" & EpisodeList[[#This Row],[Show]] & \" Season Info'!C2:J15\"), 8,1)","v":"2010-11"}]
["30 Rock","Season 5",5,{"$f":"A267& \" S\" &C267","v":"30 Rock S5"},82,2,"\"When It Rains, It Pours\"","Don Scardino","Robert Carlock","2010-09-30",{"$f":"CHOOSE(WEEKDAY(J267),\"Sun\",\"Mon\",\"Tue\",\"Wed\",\"Thu\",\"Fri\",\"Sat\")","v":"Thu"},"20:30:00",502,5.68,266,"",{"$f":"VLOOKUP(EpisodeList[[#This Row],[Season Number]], INDIRECT(\"'\" & EpisodeList[[#This Row],[Show]] & \" Season Info'!C2:J15\"), 8,1)","v":"2010-11"}]
["The Office","Season 7",7,{"$f":"A268& \" S\" &C268","v":"The Office S7"},128,2,"\"Counseling\"","Jeffrey Blitz","B. J. Novak","2010-09-30",{"$f":"CHOOSE(WEEKDAY(J268),\"Sun\",\"Mon\",\"Tue\",\"Wed\",\"Thu\",\"Fri\",\"Sat\")","v":"Thu"},"21:00:00",7002,7.36,267,"",{"$f":"VLOOKUP(EpisodeList[[#This Row],[Season Number]], INDIRECT(\"'\" & EpisodeList[[#This Row],[Show]] & \" Season Info'!C2:J15\"), 8,1)","v":"2010-11"}]
["Community","Season 2",2,{"$f":"A269& \" S\" &C269","v":"Community S2"},28,3,"\"The Psychology of Letting Go\"","Anthony Russo","Hilary Winston","2010-10-07",{"$f":"CHOOSE(WEEKDAY(J269),\"Sun\",\"Mon\",\"Tue\",\"Wed\",\"Thu\",\"Fri\",\"Sat\")","v":"Thu"},"20:00:00",202,4.2,268,"",{"$f":"VLOOKUP(EpisodeList[[#This Row],[Season Number]], INDIRECT(\"'\" & EpisodeList[[#This Row],[Show]] & \" Season Info'!C2:J15\"), 8,1)","v":"2010-11"}]
["30 Rock","Season 5",5,{"$f":"A270& \" S\" &C270","v":"30 Rock S5"},83,3,"\"Let's Stay Together\"","John Riggi","Jack Burditt","2010-10-07",{"$f":"CHOOSE(WEEKDAY(J270),\"Sun\",\"Mon\",\"Tue\",\"Wed\",\"Thu\",\"Fri\",\"Sat\")","v":"Thu"},"20:30:00",503,4.9000000000000004,269,"",{"$f":"VLOOKUP(EpisodeList[[#This Row],[Season Number]], INDIRECT(\"'\" & EpisodeList[[#This Row],[Show]] & \" Season Info'!C2:J15\"), 8,1)","v":"2010-11"}]
["The Office","Season 7",7,{"$f":"A271& \" S\" &C271","v":"The Office S7"},129,3,"\"Andy's Play\"","John Stuart Scott","Charlie Grandy","2010-10-07",{"$f":"CHOOSE(WEEKDAY(J271),\"Sun\",\"Mon\",\"Tue\",\"Wed\",\"Thu\",\"Fri\",\"Sat\")","v":"Thu"},"21:00:00",7003,6.95,270,"",{"$f":"VLOOKUP(EpisodeList[[#This Row],[Season Number]], INDIRECT(\"'\" & EpisodeList[[#This Row],[Show]] & \" Season Info'!C2:J15\"), 8,1)","v":"2010-11"}]
["Community","Season 2",2,{"$f":"A272& \" S\" &C272","v":"Community S2"},29,4,"\"Basic Rocket Science\"","Anthony Russo","Andy Bobrow","2010-10-14",{"$f":"CHOOSE(WEEKDAY(J272),\"Sun\",\"Mon\",\"Tue\",\"Wed\",\"Thu\",\"Fri\",\"Sat\")","v":"Thu"},"20:00:00",204,4.8099999999999996,271,"",{"$f":"VLOOKUP(EpisodeList[[#This Row],[Season Number]], INDIRECT(\"'\" & EpisodeList[[#This Row],[Show]] & \" Season Info'!C2:J15\"), 8,1)","v":"2010-11"}]
["30 Rock","Season 5",5,{"$f":"A273& \" S\" &C273","v":"30 Rock S5"},84,4,"\"Live Show\"","Beth McCarthy-Miller","Robert Carlock & Tina Fey","2010-10-14",{"$f":"CHOOSE(WEEKDAY(J273),\"Sun\",\"Mon\",\"Tue\",\"Wed\",\"Thu\",\"Fri\",\"Sat\")","v":"Thu"},"20:30:00",504,6.7,272,"",{"$f":"VLOOKUP(EpisodeList[[#This Row],[Season Number]], INDIRECT(\"'\" & EpisodeList[[#This Row],[Show]] & \" Season Info'!C2:J15\"), 8,1)","v":"2010-11"}]
["The Office","Season 7",7,{"$f":"A274& \" S\" &C274","v":"The Office S7"},130,4,"\"Sex Ed\"","Paul Lieberstein","Paul Lieberstein","2010-10-14",{"$f":"CHOOSE(WEEKDAY(J274),\"Sun\",\"Mon\",\"Tue\",\"Wed\",\"Thu\",\"Fri\",\"Sat\")","v":"Thu"},"21:00:00",7004,7.36,273,"",{"$f":"VLOOKUP(EpisodeList[[#This Row],[Season Number]], INDIRECT(\"'\" & EpisodeList[[#This Row],[Show]] & \" Season Info'!C2:J15\"), 8,1)","v":"2010-11"}]
["Community","Season 2",2,{"$f":"A275& \" S\" &C275","v":"Community S2"},30,5,"\"Messianic Myths and Ancient Peoples\"","Tristram Shapeero","Andrew Guest","2010-10-21",{"$f":"CHOOSE(WEEKDAY(J275),\"Sun\",\"Mon\",\"Tue\",\"Wed\",\"Thu\",\"Fri\",\"Sat\")","v":"Thu"},"20:00:00",205,4.46,274,"",{"$f":"VLOOKUP(EpisodeList[[#This Row],[Season Number]], INDIRECT(\"'\" & EpisodeList[[#This Row],[Show]] & \" Season Info'!C2:J15\"), 8,1)","v":"2010-11"}]
["30 Rock","Season 5",5,{"$f":"A276& \" S\" &C276","v":"30 Rock S5"},85,5,"\"Reaganing\"","Todd Holland","Matt Hubbard","2010-10-21",{"$f":"CHOOSE(WEEKDAY(J276),\"Sun\",\"Mon\",\"Tue\",\"Wed\",\"Thu\",\"Fri\",\"Sat\")","v":"Thu"},"20:30:00",505,5.18,275,"",{"$f":"VLOOKUP(EpisodeList[[#This Row],[Season Number]], INDIRECT(\"'\" & EpisodeList[[#This Row],[Show]] & \" Season Info'!C2:J15\"), 8,1)","v":"2010-11"}]
["The Office","Season 7",7,{"$f":"A277& \" S\" &C277","v":"The Office S7"},131,5,"\"The Sting\"","Randall Einhorn","Mindy Kaling","2010-10-21",{"$f":"CHOOSE(WEEKDAY(J277),\"Sun\",\"Mon\",\"Tue\",\"Wed\",\"Thu\",\"Fri\",\"Sat\")","v":"Thu"},"21:00:00",7005,6.87,276,"",{"$f":"VLOOKUP(EpisodeList[[#This Row],[Season Number]], INDIRECT(\"'\" & EpisodeList[[#This Row],[Show]] & \" Season Info'!C2:J15\"), 8,1)","v":"2010-11"}]
["Community","Season 2",2,{"$f":"A278& \" S\" &C278","v":"Community S2"},31,6,"\"Epidemiology\"","Anthony Hemingway","Karey Dornetto","2010-10-28",{"$f":"CHOOSE(WEEKDAY(J278),\"Sun\",\"Mon\",\"Tue\",\"Wed\",\"Thu\",\"Fri\",\"Sat\")","v":"Thu"},"20:00:00",206,5.64,277,"",{"$f":"VLOOKUP(EpisodeList[[#This Row],[Season Number]], INDIRECT(\"'\" & EpisodeList[[#This Row],[Show]] & \" Season Info'!C2:J15\"), 8,1)","v":"2010-11"}]
["The Office","Season 7",7,{"$f":"A279& \" S\" &C279","v":"The Office S7"},132,6,"\"Costume Contest\"","Dean Holland","Justin Spitzer","2010-10-28",{"$f":"CHOOSE(WEEKDAY(J279),\"Sun\",\"Mon\",\"Tue\",\"Wed\",\"Thu\",\"Fri\",\"Sat\")","v":"Thu"},"21:00:00",7006,8.07,278,"",{"$f":"VLOOKUP(EpisodeList[[#This Row],[Season Number]], INDIRECT(\"'\" & EpisodeList[[#This Row],[Show]] & \" Season Info'!C2:J15\"), 8,1)","v":"2010-11"}]
["Community","Season 2",2,{"$f":"A280& \" S\" &C280","v":"Community S2"},32,7,"\"Aerodynamics of Gender\"","Tristram Shapeero","Adam Countee","2010-11-04",{"$f":"CHOOSE(WEEKDAY(J280),\"Sun\",\"Mon\",\"Tue\",\"Wed\",\"Thu\",\"Fri\",\"Sat\")","v":"Thu"},"20:00:00",207,4.6100000000000003,279,"",{"$f":"VLOOKUP(EpisodeList[[#This Row],[Season Number]], INDIRECT(\"'\" & EpisodeList[[#This Row],[Show]] & \" Season Info'!C2:J15\"), 8,1)","v":"2010-11"}]
["30 Rock","Season 5",5,{"$f":"A281& \" S\" &C281","v":"30 Rock S5"},86,6,"\"Gentleman's Intermission\"","Don Scardino","John Riggi","2010-11-04",{"$f":"CHOOSE(WEEKDAY(J281),\"Sun\",\"Mon\",\"Tue\",\"Wed\",\"Thu\",\"Fri\",\"Sat\")","v":"Thu"},"20:30:00",506,5.31,280,"",{"$f":"VLOOKUP(EpisodeList[[#This Row],[Season Number]], INDIRECT(\"'\" & EpisodeList[[#This Row],[Show]] & \" Season Info'!C2:J15\"), 8,1)","v":"2010-11"}]
["The Office","Season 7",7,{"$f":"A282& \" S\" &C282","v":"The Office S7"},133,7,"\"Christening\"","Alex Hardcastle","Peter Ocko","2010-11-04",{"$f":"CHOOSE(WEEKDAY(J282),\"Sun\",\"Mon\",\"Tue\",\"Wed\",\"Thu\",\"Fri\",\"Sat\")","v":"Thu"},"21:00:00",7007,7.65,281,"",{"$f":"VLOOKUP(EpisodeList[[#This Row],[Season Number]], INDIRECT(\"'\" & EpisodeList[[#This Row],[Show]] & \" Season Info'!C2:J15\"), 8,1)","v":"2010-11"}]
["Community","Season 2",2,{"$f":"A283& \" S\" &C283","v":"Community S2"},33,8,"\"Cooperative Calligraphy\"","Joe Russo","Megan Ganz","2010-11-11",{"$f":"CHOOSE(WEEKDAY(J283),\"Sun\",\"Mon\",\"Tue\",\"Wed\",\"Thu\",\"Fri\",\"Sat\")","v":"Thu"},"20:00:00",208,4.53,282,"",{"$f":"VLOOKUP(EpisodeList[[#This Row],[Season Number]], INDIRECT(\"'\" & EpisodeList[[#This Row],[Show]] & \" Season Info'!C2:J15\"), 8,1)","v":"2010-11"}]
["30 Rock","Season 5",5,{"$f":"A284& \" S\" &C284","v":"30 Rock S5"},87,7,"\"Brooklyn Without Limits\"","Michael Engler","Ron Weiner","2010-11-11",{"$f":"CHOOSE(WEEKDAY(J284),\"Sun\",\"Mon\",\"Tue\",\"Wed\",\"Thu\",\"Fri\",\"Sat\")","v":"Thu"},"20:30:00",507,5.09,283,"",{"$f":"VLOOKUP(EpisodeList[[#This Row],[Season Number]], INDIRECT(\"'\" & EpisodeList[[#This Row],[Show]] & \" Season Info'!C2:J15\"), 8,1)","v":"2010-11"}]
["The Office","Season 7",7,{"$f":"A285& \" S\" &C285","v":"The Office S7"},134,8,"\"Viewing Party\"","Ken Whittingham","Jon Vitti","2010-11-11",{"$f":"CHOOSE(WEEKDAY(J285),\"Sun\",\"Mon\",\"Tue\",\"Wed\",\"Thu\",\"Fri\",\"Sat\")","v":"Thu"},"21:00:00",7008,7.15,284,"",{"$f":"VLOOKUP(EpisodeList[[#This Row],[Season Number]], INDIRECT(\"'\" & EpisodeList[[#This Row],[Show]] & \" Season Info'!C2:J15\"), 8,1)","v":"2010-11"}]
["Community","Season 2",2,{"$f":"A286& \" S\" &C286","v":"Community S2"},34,9,"\"Conspiracy Theories and Interior Design\"","Adam Davidson","Chris McKenna","2010-11-18",{"$f":"CHOOSE(WEEKDAY(J286),\"Sun\",\"Mon\",\"Tue\",\"Wed\",\"Thu\",\"Fri\",\"Sat\")","v":"Thu"},"20:00:00",210,4.41,285,"",{"$f":"VLOOKUP(EpisodeList[[#This Row],[Season Number]], INDIRECT(\"'\" & EpisodeList[[#This Row],[Show]] & \" Season Info'!C2:J15\"), 8,1)","v":"2010-11"}]
["30 Rock","Season 5",5,{"$f":"A287& \" S\" &C287","v":"30 Rock S5"},88,8,"\"College\"","Don Scardino","Josh Siegal & Dylan Morgan","2010-11-18",{"$f":"CHOOSE(WEEKDAY(J287),\"Sun\",\"Mon\",\"Tue\",\"Wed\",\"Thu\",\"Fri\",\"Sat\")","v":"Thu"},"20:30:00",508,5.1100000000000003,286,"",{"$f":"VLOOKUP(EpisodeList[[#This Row],[Season Number]], INDIRECT(\"'\" & EpisodeList[[#This Row],[Show]] & \" Season Info'!C2:J15\"), 8,1)","v":"2010-11"}]
["The Office","Season 7",7,{"$f":"A288& \" S\" &C288","v":"The Office S7"},135,9,"\"WUPHF.com\"","Danny Leiner","Aaron Shure","2010-11-18",{"$f":"CHOOSE(WEEKDAY(J288),\"Sun\",\"Mon\",\"Tue\",\"Wed\",\"Thu\",\"Fri\",\"Sat\")","v":"Thu"},"21:00:00",7009,7.28,287,"",{"$f":"VLOOKUP(EpisodeList[[#This Row],[Season Number]], INDIRECT(\"'\" & EpisodeList[[#This Row],[Show]] & \" Season Info'!C2:J15\"), 8,1)","v":"2010-11"}]
["Community","Season 2",2,{"$f":"A289& \" S\" &C289","v":"Community S2"},35,10,"\"Mixology Certification\"","Jay Chandrasekhar","Andy Bobrow","2010-12-02",{"$f":"CHOOSE(WEEKDAY(J289),\"Sun\",\"Mon\",\"Tue\",\"Wed\",\"Thu\",\"Fri\",\"Sat\")","v":"Thu"},"20:00:00",209,4.55,288,"",{"$f":"VLOOKUP(EpisodeList[[#This Row],[Season Number]], INDIRECT(\"'\" & EpisodeList[[#This Row],[Show]] & \" Season Info'!C2:J15\"), 8,1)","v":"2010-11"}]
["30 Rock","Season 5",5,{"$f":"A290& \" S\" &C290","v":"30 Rock S5"},89,9,"\"Chain Reaction of Mental Anguish\"","Ken Whittingham","Kay Cannon","2010-12-02",{"$f":"CHOOSE(WEEKDAY(J290),\"Sun\",\"Mon\",\"Tue\",\"Wed\",\"Thu\",\"Fri\",\"Sat\")","v":"Thu"},"20:30:00",509,5.03,289,"",{"$f":"VLOOKUP(EpisodeList[[#This Row],[Season Number]], INDIRECT(\"'\" & EpisodeList[[#This Row],[Show]] & \" Season Info'!C2:J15\"), 8,1)","v":"2010-11"}]
["The Office","Season 7",7,{"$f":"A291& \" S\" &C291","v":"The Office S7"},136,10,"\"China\"","Charles McDougall","Halsted Sullivan & Warren Lieberstein","2010-12-02",{"$f":"CHOOSE(WEEKDAY(J291),\"Sun\",\"Mon\",\"Tue\",\"Wed\",\"Thu\",\"Fri\",\"Sat\")","v":"Thu"},"21:00:00",7010,7.31,290,"",{"$f":"VLOOKUP(EpisodeList[[#This Row],[Season Number]], INDIRECT(\"'\" & EpisodeList[[#This Row],[Show]] & \" Season Info'!C2:J15\"), 8,1)","v":"2010-11"}]
["Community","Season 2",2,{"$f":"A292& \" S\" &C292","v":"Community S2"},36,11,"\"Abed's Uncontrollable Christmas\"","Duke Johnson","Dino Stamatopoulos & Dan Harmon","2010-12-09",{"$f":"CHOOSE(WEEKDAY(J292),\"Sun\",\"Mon\",\"Tue\",\"Wed\",\"Thu\",\"Fri\",\"Sat\")","v":"Thu"},"20:00:00",222,4.29,291,"",{"$f":"VLOOKUP(EpisodeList[[#This Row],[Season Number]], INDIRECT(\"'\" & EpisodeList[[#This Row],[Show]] & \" Season Info'!C2:J15\"), 8,1)","v":"2010-11"}]
["30 Rock","Season 5",5,{"$f":"A293& \" S\" &C293","v":"30 Rock S5"},90,10,"\"Christmas Attack Zone\"","John Riggi","Tracey Wigfield","2010-12-09",{"$f":"CHOOSE(WEEKDAY(J293),\"Sun\",\"Mon\",\"Tue\",\"Wed\",\"Thu\",\"Fri\",\"Sat\")","v":"Thu"},"20:30:00",510,4.76,292,"",{"$f":"VLOOKUP(EpisodeList[[#This Row],[Season Number]], INDIRECT(\"'\" & EpisodeList[[#This Row],[Show]] & \" Season Info'!C2:J15\"), 8,1)","v":"2010-11"}]
["The Office","Season 7",7,{"$f":"A294& \" S\" &C294","v":"The Office S7"},137,11,"\"Classy Christmas\"","Rainn Wilson","Mindy Kaling","2010-12-09",{"$f":"CHOOSE(WEEKDAY(J294),\"Sun\",\"Mon\",\"Tue\",\"Wed\",\"Thu\",\"Fri\",\"Sat\")","v":"Thu"},"21:00:00",7011,7.18,293,"",{"$f":"VLOOKUP(EpisodeList[[#This Row],[Season Number]], INDIRECT(\"'\" & EpisodeList[[#This Row],[Show]] & \" Season Info'!C2:J15\"), 8,1)","v":"2010-11"}]
["The Office","Season 7",7,{"$f":"A295& \" S\" &C295","v":"The Office S7"},138,12,"\"Classy Christmas\"","Rainn Wilson","Mindy Kaling","2010-12-09",{"$f":"CHOOSE(WEEKDAY(J295),\"Sun\",\"Mon\",\"Tue\",\"Wed\",\"Thu\",\"Fri\",\"Sat\")","v":"Thu"},"21:30:00",7012,7.18,294,"",{"$f":"VLOOKUP(EpisodeList[[#This Row],[Season Number]], INDIRECT(\"'\" & EpisodeList[[#This Row],[Show]] & \" Season Info'!C2:J15\"), 8,1)","v":"2010-11"}]
["Community","Season 2",2,{"$f":"A296& \" S\" &C296","v":"Community S2"},37,12,"\"Asian Population Studies\"","Anthony Russo","Emily Cutler","2011-01-20",{"$f":"CHOOSE(WEEKDAY(J296),\"Sun\",\"Mon\",\"Tue\",\"Wed\",\"Thu\",\"Fri\",\"Sat\")","v":"Thu"},"20:00:00",211,4.7300000000000004,295,"Yes",{"$f":"VLOOKUP(EpisodeList[[#This Row],[Season Number]], INDIRECT(\"'\" & EpisodeList[[#This Row],[Show]] & \" Season Info'!C2:J15\"), 8,1)","v":"2010-11"}]
["The Office","Season 7",7,{"$f":"A297& \" S\" &C297","v":"The Office S7"},139,13,"\"Ultimatum\"","David Rogers","Carrie Kemper","2011-01-20",{"$f":"CHOOSE(WEEKDAY(J297),\"Sun\",\"Mon\",\"Tue\",\"Wed\",\"Thu\",\"Fri\",\"Sat\")","v":"Thu"},"21:00:00",7013,8.26,296,"Yes",{"$f":"VLOOKUP(EpisodeList[[#This Row],[Season Number]], INDIRECT(\"'\" & EpisodeList[[#This Row],[Show]] & \" Season Info'!C2:J15\"), 8,1)","v":"2010-11"}]
["Parks and Rec","Season 3",3,{"$f":"A298& \" S\" &C298","v":"Parks and Rec S3"},31,1,"\"Go Big or Go Home\"","Dean Holland","Alan Yang","2011-01-20",{"$f":"CHOOSE(WEEKDAY(J298),\"Sun\",\"Mon\",\"Tue\",\"Wed\",\"Thu\",\"Fri\",\"Sat\")","v":"Thu"},"21:30:00",null,6.14,297,"Yes",{"$f":"VLOOKUP(EpisodeList[[#This Row],[Season Number]], INDIRECT(\"'\" & EpisodeList[[#This Row],[Show]] & \" Season Info'!C2:J15\"), 8,1)","v":"2010-11"}]
["30 Rock","Season 5",5,{"$f":"A299& \" S\" &C299","v":"30 Rock S5"},91,11,"\"Mrs. Donaghy\"","Tricia Brock","Jack Burditt","2011-01-20",{"$f":"CHOOSE(WEEKDAY(J299),\"Sun\",\"Mon\",\"Tue\",\"Wed\",\"Thu\",\"Fri\",\"Sat\")","v":"Thu"},"22:00:00",511,5.34,298,"Yes",{"$f":"VLOOKUP(EpisodeList[[#This Row],[Season Number]], INDIRECT(\"'\" & EpisodeList[[#This Row],[Show]] & \" Season Info'!C2:J15\"), 8,1)","v":"2010-11"}]
["Community","Season 2",2,{"$f":"A300& \" S\" &C300","v":"Community S2"},38,13,"\"Celebrity Pharmacology\"","Fred Goss","Hilary Winston","2011-01-27",{"$f":"CHOOSE(WEEKDAY(J300),\"Sun\",\"Mon\",\"Tue\",\"Wed\",\"Thu\",\"Fri\",\"Sat\")","v":"Thu"},"20:00:00",212,4.59,299,"Yes",{"$f":"VLOOKUP(EpisodeList[[#This Row],[Season Number]], INDIRECT(\"'\" & EpisodeList[[#This Row],[Show]] & \" Season Info'!C2:J15\"), 8,1)","v":"2010-11"}]
["The Office","Season 7",7,{"$f":"A301& \" S\" &C301","v":"The Office S7"},140,14,"\"The Seminar\"","B. J. Novak","Steve Hely","2011-01-27",{"$f":"CHOOSE(WEEKDAY(J301),\"Sun\",\"Mon\",\"Tue\",\"Wed\",\"Thu\",\"Fri\",\"Sat\")","v":"Thu"},"21:00:00",7014,7.93,300,"Yes",{"$f":"VLOOKUP(EpisodeList[[#This Row],[Season Number]], INDIRECT(\"'\" & EpisodeList[[#This Row],[Show]] & \" Season Info'!C2:J15\"), 8,1)","v":"2010-11"}]
["Parks and Rec","Season 3",3,{"$f":"A302& \" S\" &C302","v":"Parks and Rec S3"},32,2,"\"Flu Season\"","Wendey Stanzler","Norm Hiscock","2011-01-27",{"$f":"CHOOSE(WEEKDAY(J302),\"Sun\",\"Mon\",\"Tue\",\"Wed\",\"Thu\",\"Fri\",\"Sat\")","v":"Thu"},"21:30:00",null,5.83,301,"Yes",{"$f":"VLOOKUP(EpisodeList[[#This Row],[Season Number]], INDIRECT(\"'\" & EpisodeList[[#This Row],[Show]] & \" Season Info'!C2:J15\"), 8,1)","v":"2010-11"}]
["30 Rock","Season 5",5,{"$f":"A303& \" S\" &C303","v":"30 Rock S5"},92,12,"\"Operation Righteous Cowboy Lightning\"","Beth McCarthy-Miller","Robert Carlock","2011-01-27",{"$f":"CHOOSE(WEEKDAY(J303),\"Sun\",\"Mon\",\"Tue\",\"Wed\",\"Thu\",\"Fri\",\"Sat\")","v":"Thu"},"22:00:00",512,4.92,302,"Yes",{"$f":"VLOOKUP(EpisodeList[[#This Row],[Season Number]], INDIRECT(\"'\" & EpisodeList[[#This Row],[Show]] & \" Season Info'!C2:J15\"), 8,1)","v":"2010-11"}]
["Community","Season 2",2,{"$f":"A304& \" S\" &C304","v":"Community S2"},39,14,"\"Advanced Dungeons & Dragons\"","Joe Russo","Andrew Guest","2011-02-03",{"$f":"CHOOSE(WEEKDAY(J304),\"Sun\",\"Mon\",\"Tue\",\"Wed\",\"Thu\",\"Fri\",\"Sat\")","v":"Thu"},"20:00:00",214,4.37,303,"Yes",{"$f":"VLOOKUP(EpisodeList[[#This Row],[Season Number]], INDIRECT(\"'\" & EpisodeList[[#This Row],[Show]] & \" Season Info'!C2:J15\"), 8,1)","v":"2010-11"}]
["The Office","Season 7",7,{"$f":"A305& \" S\" &C305","v":"The Office S7"},141,15,"\"The Search\"","Michael Spiller","Brent Forrester","2011-02-03",{"$f":"CHOOSE(WEEKDAY(J305),\"Sun\",\"Mon\",\"Tue\",\"Wed\",\"Thu\",\"Fri\",\"Sat\")","v":"Thu"},"21:00:00",7015,7.29,304,"Yes",{"$f":"VLOOKUP(EpisodeList[[#This Row],[Season Number]], INDIRECT(\"'\" & EpisodeList[[#This Row],[Show]] & \" Season Info'!C2:J15\"), 8,1)","v":"2010-11"}]
["Parks and Rec","Season 3",3,{"$f":"A306& \" S\" &C306","v":"Parks and Rec S3"},33,3,"\"Time Capsule\"","Michael Schur","Michael Schur","2011-02-03",{"$f":"CHOOSE(WEEKDAY(J306),\"Sun\",\"Mon\",\"Tue\",\"Wed\",\"Thu\",\"Fri\",\"Sat\")","v":"Thu"},"21:30:00",null,4.95,305,"Yes",{"$f":"VLOOKUP(EpisodeList[[#This Row],[Season Number]], INDIRECT(\"'\" & EpisodeList[[#This Row],[Show]] & \" Season Info'!C2:J15\"), 8,1)","v":"2010-11"}]
["30 Rock","Season 5",5,{"$f":"A307& \" S\" &C307","v":"30 Rock S5"},93,13,"\"Qué Sorpresa!\"","John Riggi","Matt Hubbard","2011-02-03",{"$f":"CHOOSE(WEEKDAY(J307),\"Sun\",\"Mon\",\"Tue\",\"Wed\",\"Thu\",\"Fri\",\"Sat\")","v":"Thu"},"22:00:00",513,4.78,306,"Yes",{"$f":"VLOOKUP(EpisodeList[[#This Row],[Season Number]], INDIRECT(\"'\" & EpisodeList[[#This Row],[Show]] & \" Season Info'!C2:J15\"), 8,1)","v":"2010-11"}]
["Community","Season 2",2,{"$f":"A308& \" S\" &C308","v":"Community S2"},40,15,"\"Early 21st Century Romanticism\"","Steven Sprung","Karey Dornetto","2011-02-10",{"$f":"CHOOSE(WEEKDAY(J308),\"Sun\",\"Mon\",\"Tue\",\"Wed\",\"Thu\",\"Fri\",\"Sat\")","v":"Thu"},"20:00:00",213,3.81,307,"Yes",{"$f":"VLOOKUP(EpisodeList[[#This Row],[Season Number]], INDIRECT(\"'\" & EpisodeList[[#This Row],[Show]] & \" Season Info'!C2:J15\"), 8,1)","v":"2010-11"}]
["The Office","Season 7",7,{"$f":"A309& \" S\" &C309","v":"The Office S7"},142,16,"\"PDA\"","Greg Daniels","Robert Padnick","2011-02-10",{"$f":"CHOOSE(WEEKDAY(J309),\"Sun\",\"Mon\",\"Tue\",\"Wed\",\"Thu\",\"Fri\",\"Sat\")","v":"Thu"},"21:00:00",7017,6.9,308,"Yes",{"$f":"VLOOKUP(EpisodeList[[#This Row],[Season Number]], INDIRECT(\"'\" & EpisodeList[[#This Row],[Show]] & \" Season Info'!C2:J15\"), 8,1)","v":"2010-11"}]
["Parks and Rec","Season 3",3,{"$f":"A310& \" S\" &C310","v":"Parks and Rec S3"},34,4,"\"Ron & Tammy: Part Two\"","Tucker Gates","Emily Kapnek","2011-02-10",{"$f":"CHOOSE(WEEKDAY(J310),\"Sun\",\"Mon\",\"Tue\",\"Wed\",\"Thu\",\"Fri\",\"Sat\")","v":"Thu"},"21:30:00",null,5.03,309,"Yes",{"$f":"VLOOKUP(EpisodeList[[#This Row],[Season Number]], INDIRECT(\"'\" & EpisodeList[[#This Row],[Show]] & \" Season Info'!C2:J15\"), 8,1)","v":"2010-11"}]
["30 Rock","Season 5",5,{"$f":"A311& \" S\" &C311","v":"30 Rock S5"},94,14,"\"Double-Edged Sword\"","Don Scardino","Kay Cannon & Tom Ceraulo","2011-02-10",{"$f":"CHOOSE(WEEKDAY(J311),\"Sun\",\"Mon\",\"Tue\",\"Wed\",\"Thu\",\"Fri\",\"Sat\")","v":"Thu"},"22:00:00",514,4.59,310,"Yes",{"$f":"VLOOKUP(EpisodeList[[#This Row],[Season Number]], INDIRECT(\"'\" & EpisodeList[[#This Row],[Show]] & \" Season Info'!C2:J15\"), 8,1)","v":"2010-11"}]
["Community","Season 2",2,{"$f":"A312& \" S\" &C312","v":"Community S2"},41,16,"\"Intermediate Documentary Filmmaking\"","Joe Russo","Megan Ganz","2011-02-17",{"$f":"CHOOSE(WEEKDAY(J312),\"Sun\",\"Mon\",\"Tue\",\"Wed\",\"Thu\",\"Fri\",\"Sat\")","v":"Thu"},"20:00:00",215,4.1100000000000003,311,"Yes",{"$f":"VLOOKUP(EpisodeList[[#This Row],[Season Number]], INDIRECT(\"'\" & EpisodeList[[#This Row],[Show]] & \" Season Info'!C2:J15\"), 8,1)","v":"2010-11"}]
["The Office","Season 7",7,{"$f":"A313& \" S\" &C313","v":"The Office S7"},143,17,"\"Threat Level Midnight\"","Tucker Gates","B. J. Novak","2011-02-17",{"$f":"CHOOSE(WEEKDAY(J313),\"Sun\",\"Mon\",\"Tue\",\"Wed\",\"Thu\",\"Fri\",\"Sat\")","v":"Thu"},"21:00:00",7016,6.41,312,"Yes",{"$f":"VLOOKUP(EpisodeList[[#This Row],[Season Number]], INDIRECT(\"'\" & EpisodeList[[#This Row],[Show]] & \" Season Info'!C2:J15\"), 8,1)","v":"2010-11"}]
["Parks and Rec","Season 3",3,{"$f":"A314& \" S\" &C314","v":"Parks and Rec S3"},35,5,"\"Media Blitz\"","David Rogers","Harris Wittels","2011-02-17",{"$f":"CHOOSE(WEEKDAY(J314),\"Sun\",\"Mon\",\"Tue\",\"Wed\",\"Thu\",\"Fri\",\"Sat\")","v":"Thu"},"21:30:00",null,4.33,313,"Yes",{"$f":"VLOOKUP(EpisodeList[[#This Row],[Season Number]], INDIRECT(\"'\" & EpisodeList[[#This Row],[Show]] & \" Season Info'!C2:J15\"), 8,1)","v":"2010-11"}]
["30 Rock","Season 5",5,{"$f":"A315& \" S\" &C315","v":"30 Rock S5"},95,15,"\"It's Never Too Late for Now\"","John Riggi","Vali Chandrasekaran","2011-02-17",{"$f":"CHOOSE(WEEKDAY(J315),\"Sun\",\"Mon\",\"Tue\",\"Wed\",\"Thu\",\"Fri\",\"Sat\")","v":"Thu"},"22:00:00",515,4.07,314,"Yes",{"$f":"VLOOKUP(EpisodeList[[#This Row],[Season Number]], INDIRECT(\"'\" & EpisodeList[[#This Row],[Show]] & \" Season Info'!C2:J15\"), 8,1)","v":"2010-11"}]
["Community","Season 2",2,{"$f":"A316& \" S\" &C316","v":"Community S2"},42,17,"\"Intro to Political Science\"","Jay Chandrasekhar","Adam Countee","2011-02-24",{"$f":"CHOOSE(WEEKDAY(J316),\"Sun\",\"Mon\",\"Tue\",\"Wed\",\"Thu\",\"Fri\",\"Sat\")","v":"Thu"},"20:00:00",216,3.79,315,"Yes",{"$f":"VLOOKUP(EpisodeList[[#This Row],[Season Number]], INDIRECT(\"'\" & EpisodeList[[#This Row],[Show]] & \" Season Info'!C2:J15\"), 8,1)","v":"2010-11"}]
["The Office","Season 7",7,{"$f":"A317& \" S\" &C317","v":"The Office S7"},144,18,"\"Todd Packer\"","Randall Einhorn","Amelie Gillette","2011-02-24",{"$f":"CHOOSE(WEEKDAY(J317),\"Sun\",\"Mon\",\"Tue\",\"Wed\",\"Thu\",\"Fri\",\"Sat\")","v":"Thu"},"21:00:00",7018,6.12,316,"Yes",{"$f":"VLOOKUP(EpisodeList[[#This Row],[Season Number]], INDIRECT(\"'\" & EpisodeList[[#This Row],[Show]] & \" Season Info'!C2:J15\"), 8,1)","v":"2010-11"}]
["Parks and Rec","Season 3",3,{"$f":"A318& \" S\" &C318","v":"Parks and Rec S3"},36,6,"\"Indianapolis\"","Randall Einhorn","Katie Dippold","2011-02-24",{"$f":"CHOOSE(WEEKDAY(J318),\"Sun\",\"Mon\",\"Tue\",\"Wed\",\"Thu\",\"Fri\",\"Sat\")","v":"Thu"},"21:30:00",null,4.59,317,"Yes",{"$f":"VLOOKUP(EpisodeList[[#This Row],[Season Number]], INDIRECT(\"'\" & EpisodeList[[#This Row],[Show]] & \" Season Info'!C2:J15\"), 8,1)","v":"2010-11"}]
["30 Rock","Season 5",5,{"$f":"A319& \" S\" &C319","v":"30 Rock S5"},96,16,"\"TGS Hates Women\"","Beth McCarthy-Miller","Ron Weiner","2011-02-24",{"$f":"CHOOSE(WEEKDAY(J319),\"Sun\",\"Mon\",\"Tue\",\"Wed\",\"Thu\",\"Fri\",\"Sat\")","v":"Thu"},"22:00:00",516,4.5,318,"Yes",{"$f":"VLOOKUP(EpisodeList[[#This Row],[Season Number]], INDIRECT(\"'\" & EpisodeList[[#This Row],[Show]] & \" Season Info'!C2:J15\"), 8,1)","v":"2010-11"}]
["Community","Season 2",2,{"$f":"A320& \" S\" &C320","v":"Community S2"},43,18,"\"Custody Law and Eastern European Diplomacy\"","Anthony Russo","Andy Bobrow","2011-03-17",{"$f":"CHOOSE(WEEKDAY(J320),\"Sun\",\"Mon\",\"Tue\",\"Wed\",\"Thu\",\"Fri\",\"Sat\")","v":"Thu"},"20:00:00",217,4.1500000000000004,319,"",{"$f":"VLOOKUP(EpisodeList[[#This Row],[Season Number]], INDIRECT(\"'\" & EpisodeList[[#This Row],[Show]] & \" Season Info'!C2:J15\"), 8,1)","v":"2010-11"}]
["Parks and Rec","Season 3",3,{"$f":"A321& \" S\" &C321","v":"Parks and Rec S3"},37,7,"\"Harvest Festival\"","Dean Holland","Dan Goor","2011-03-17",{"$f":"CHOOSE(WEEKDAY(J321),\"Sun\",\"Mon\",\"Tue\",\"Wed\",\"Thu\",\"Fri\",\"Sat\")","v":"Thu"},"21:30:00",null,4.08,320,"",{"$f":"VLOOKUP(EpisodeList[[#This Row],[Season Number]], INDIRECT(\"'\" & EpisodeList[[#This Row],[Show]] & \" Season Info'!C2:J15\"), 8,1)","v":"2010-11"}]
["30 Rock","Season 5",5,{"$f":"A322& \" S\" &C322","v":"30 Rock S5"},97,17,"\"Queen of Jordan\"","Ken Whittingham","Tracey Wigfield","2011-03-17",{"$f":"CHOOSE(WEEKDAY(J322),\"Sun\",\"Mon\",\"Tue\",\"Wed\",\"Thu\",\"Fri\",\"Sat\")","v":"Thu"},"22:00:00",517,4.1900000000000004,321,{"$f":"IF(AND(\n    COUNTIFS(A:A, A322, J:J, J322) = 1,\n    COUNTIFS(A:A, \"30 Rock\", J:J, J322) = 1,\n    COUNTIFS(A:A, \"The Office\", J:J, J322) = 1,\n    COUNTIFS(A:A, \"Community\", J:J, J322) = 1,\n    COUNTIFS(A:A, \"Parks and Rec\", J:J, J322) = 1\n), \"Yes\", \"\")","v":""},{"$f":"VLOOKUP(EpisodeList[[#This Row],[Season Number]], INDIRECT(\"'\" & EpisodeList[[#This Row],[Show]] & \" Season Info'!C2:J15\"), 8,1)","v":"2010-11"}]
["Community","Season 2",2,{"$f":"A323& \" S\" &C323","v":"Community S2"},44,19,"\"Critical Film Studies\"","Richard Ayoade","Sona Panos","2011-03-24",{"$f":"CHOOSE(WEEKDAY(J323),\"Sun\",\"Mon\",\"Tue\",\"Wed\",\"Thu\",\"Fri\",\"Sat\")","v":"Thu"},"20:00:00",218,4.46,322,"Yes",{"$f":"VLOOKUP(EpisodeList[[#This Row],[Season Number]], INDIRECT(\"'\" & EpisodeList[[#This Row],[Show]] & \" Season Info'!C2:J15\"), 8,1)","v":"2010-11"}]
["The Office","Season 7",7,{"$f":"A324& \" S\" &C324","v":"The Office S7"},145,19,"\"Garage Sale\"","Steve Carell","Jon Vitti","2011-03-24",{"$f":"CHOOSE(WEEKDAY(J324),\"Sun\",\"Mon\",\"Tue\",\"Wed\",\"Thu\",\"Fri\",\"Sat\")","v":"Thu"},"21:00:00",7019,7.07,323,"Yes",{"$f":"VLOOKUP(EpisodeList[[#This Row],[Season Number]], INDIRECT(\"'\" & EpisodeList[[#This Row],[Show]] & \" Season Info'!C2:J15\"), 8,1)","v":"2010-11"}]
["Parks and Rec","Season 3",3,{"$f":"A325& \" S\" &C325","v":"Parks and Rec S3"},38,8,"\"Camping\"","Rob Schrab","Aisha Muharrar","2011-03-24",{"$f":"CHOOSE(WEEKDAY(J325),\"Sun\",\"Mon\",\"Tue\",\"Wed\",\"Thu\",\"Fri\",\"Sat\")","v":"Thu"},"21:30:00",null,5.15,324,"Yes",{"$f":"VLOOKUP(EpisodeList[[#This Row],[Season Number]], INDIRECT(\"'\" & EpisodeList[[#This Row],[Show]] & \" Season Info'!C2:J15\"), 8,1)","v":"2010-11"}]
["30 Rock","Season 5",5,{"$f":"A326& \" S\" &C326","v":"30 Rock S5"},98,18,"\"Plan B\"","Jeff Richmond","Josh Siegal & Dylan Morgan","2011-03-24",{"$f":"CHOOSE(WEEKDAY(J326),\"Sun\",\"Mon\",\"Tue\",\"Wed\",\"Thu\",\"Fri\",\"Sat\")","v":"Thu"},"22:00:00",518,4.3600000000000003,325,"Yes",{"$f":"VLOOKUP(EpisodeList[[#This Row],[Season Number]], INDIRECT(\"'\" & EpisodeList[[#This Row],[Show]] & \" Season Info'!C2:J15\"), 8,1)","v":"2010-11"}]
["Community","Season 2",2,{"$f":"A327& \" S\" &C327","v":"Community S2"},45,20,"\"Competitive Wine Tasting\"","Joe Russo","Emily Cutler","2011-04-14",{"$f":"CHOOSE(WEEKDAY(J327),\"Sun\",\"Mon\",\"Tue\",\"Wed\",\"Thu\",\"Fri\",\"Sat\")","v":"Thu"},"20:00:00",219,3.49,326,"Yes",{"$f":"VLOOKUP(EpisodeList[[#This Row],[Season Number]], INDIRECT(\"'\" & EpisodeList[[#This Row],[Show]] & \" Season Info'!C2:J15\"), 8,1)","v":"2010-11"}]
["The Office","Season 7",7,{"$f":"A328& \" S\" &C328","v":"The Office S7"},146,20,"\"Training Day\"","Paul Lieberstein","Daniel Chun","2011-04-14",{"$f":"CHOOSE(WEEKDAY(J328),\"Sun\",\"Mon\",\"Tue\",\"Wed\",\"Thu\",\"Fri\",\"Sat\")","v":"Thu"},"21:00:00",7020,7.87,327,"Yes",{"$f":"VLOOKUP(EpisodeList[[#This Row],[Season Number]], INDIRECT(\"'\" & EpisodeList[[#This Row],[Show]] & \" Season Info'!C2:J15\"), 8,1)","v":"2010-11"}]
["Parks and Rec","Season 3",3,{"$f":"A329& \" S\" &C329","v":"Parks and Rec S3"},39,9,"\"Andy and April's Fancy Party\"","Michael Trim","Katie Dippold","2011-04-14",{"$f":"CHOOSE(WEEKDAY(J329),\"Sun\",\"Mon\",\"Tue\",\"Wed\",\"Thu\",\"Fri\",\"Sat\")","v":"Thu"},"21:30:00",null,5.16,328,"Yes",{"$f":"VLOOKUP(EpisodeList[[#This Row],[Season Number]], INDIRECT(\"'\" & EpisodeList[[#This Row],[Show]] & \" Season Info'!C2:J15\"), 8,1)","v":"2010-11"}]
["30 Rock","Season 5",5,{"$f":"A330& \" S\" &C330","v":"30 Rock S5"},99,19,"\"I Heart Connecticut\"","Stephen Lee Davis","Vali Chandrasekaran & Jon Haller","2011-04-14",{"$f":"CHOOSE(WEEKDAY(J330),\"Sun\",\"Mon\",\"Tue\",\"Wed\",\"Thu\",\"Fri\",\"Sat\")","v":"Thu"},"22:00:00",519,4.45,329,"Yes",{"$f":"VLOOKUP(EpisodeList[[#This Row],[Season Number]], INDIRECT(\"'\" & EpisodeList[[#This Row],[Show]] & \" Season Info'!C2:J15\"), 8,1)","v":"2010-11"}]
["Community","Season 2",2,{"$f":"A331& \" S\" &C331","v":"Community S2"},46,21,"\"Paradigms of Human Memory\"","Tristram Shapeero","Chris McKenna","2011-04-21",{"$f":"CHOOSE(WEEKDAY(J331),\"Sun\",\"Mon\",\"Tue\",\"Wed\",\"Thu\",\"Fri\",\"Sat\")","v":"Thu"},"20:00:00",220,3.17,330,"Yes",{"$f":"VLOOKUP(EpisodeList[[#This Row],[Season Number]], INDIRECT(\"'\" & EpisodeList[[#This Row],[Show]] & \" Season Info'!C2:J15\"), 8,1)","v":"2010-11"}]
["The Office","Season 7",7,{"$f":"A332& \" S\" &C332","v":"The Office S7"},147,21,"\"Michael's Last Dundies\"","Mindy Kaling","Mindy Kaling","2011-04-21",{"$f":"CHOOSE(WEEKDAY(J332),\"Sun\",\"Mon\",\"Tue\",\"Wed\",\"Thu\",\"Fri\",\"Sat\")","v":"Thu"},"21:00:00",7021,6.85,331,"Yes",{"$f":"VLOOKUP(EpisodeList[[#This Row],[Season Number]], INDIRECT(\"'\" & EpisodeList[[#This Row],[Show]] & \" Season Info'!C2:J15\"), 8,1)","v":"2010-11"}]
["Parks and Rec","Season 3",3,{"$f":"A333& \" S\" &C333","v":"Parks and Rec S3"},40,10,"\"Soulmates\"","Ken Whittingham","Alan Yang","2011-04-21",{"$f":"CHOOSE(WEEKDAY(J333),\"Sun\",\"Mon\",\"Tue\",\"Wed\",\"Thu\",\"Fri\",\"Sat\")","v":"Thu"},"21:30:00",null,4.88,332,"Yes",{"$f":"VLOOKUP(EpisodeList[[#This Row],[Season Number]], INDIRECT(\"'\" & EpisodeList[[#This Row],[Show]] & \" Season Info'!C2:J15\"), 8,1)","v":"2010-11"}]
["30 Rock","Season 5",5,{"$f":"A334& \" S\" &C334","v":"30 Rock S5"},100,20,"\"100\"","Don Scardino","Jack Burditt, Robert Carlock & Tina Fey","2011-04-21",{"$f":"CHOOSE(WEEKDAY(J334),\"Sun\",\"Mon\",\"Tue\",\"Wed\",\"Thu\",\"Fri\",\"Sat\")","v":"Thu"},"22:00:00",520,4.5999999999999996,333,"Yes",{"$f":"VLOOKUP(EpisodeList[[#This Row],[Season Number]], INDIRECT(\"'\" & EpisodeList[[#This Row],[Show]] & \" Season Info'!C2:J15\"), 8,1)","v":"2010-11"}]
["Community","Season 2",2,{"$f":"A335& \" S\" &C335","v":"Community S2"},47,22,"\"Applied Anthropology and Culinary Arts\"","Jay Chandrasekhar","Karey Dornetto","2011-04-28",{"$f":"CHOOSE(WEEKDAY(J335),\"Sun\",\"Mon\",\"Tue\",\"Wed\",\"Thu\",\"Fri\",\"Sat\")","v":"Thu"},"20:00:00",221,3.35,334,"",{"$f":"VLOOKUP(EpisodeList[[#This Row],[Season Number]], INDIRECT(\"'\" & EpisodeList[[#This Row],[Show]] & \" Season Info'!C2:J15\"), 8,1)","v":"2010-11"}]
["The Office","Season 7",7,{"$f":"A336& \" S\" &C336","v":"The Office S7"},148,22,"\"Goodbye, Michael\"","Paul Feig","Greg Daniels","2011-04-28",{"$f":"CHOOSE(WEEKDAY(J336),\"Sun\",\"Mon\",\"Tue\",\"Wed\",\"Thu\",\"Fri\",\"Sat\")","v":"Thu"},"21:00:00",7022,8.42,335,"",{"$f":"VLOOKUP(EpisodeList[[#This Row],[Season Number]], INDIRECT(\"'\" & EpisodeList[[#This Row],[Show]] & \" Season Info'!C2:J15\"), 8,1)","v":"2010-11"}]
["Parks and Rec","Season 3",3,{"$f":"A337& \" S\" &C337","v":"Parks and Rec S3"},41,11,"\"Jerry's Painting\"","Dean Holland","Norm Hiscock","2011-04-28",{"$f":"CHOOSE(WEEKDAY(J337),\"Sun\",\"Mon\",\"Tue\",\"Wed\",\"Thu\",\"Fri\",\"Sat\")","v":"Thu"},"21:30:00",null,4.71,336,"",{"$f":"VLOOKUP(EpisodeList[[#This Row],[Season Number]], INDIRECT(\"'\" & EpisodeList[[#This Row],[Show]] & \" Season Info'!C2:J15\"), 8,1)","v":"2010-11"}]
["30 Rock","Season 5",5,{"$f":"A338& \" S\" &C338","v":"30 Rock S5"},101,21,"\"Everything Sunny All the Time Always\"","John Riggi","Kay Cannon & Matt Hubbard","2011-04-28",{"$f":"CHOOSE(WEEKDAY(J338),\"Sun\",\"Mon\",\"Tue\",\"Wed\",\"Thu\",\"Fri\",\"Sat\")","v":"Thu"},"22:30:00",521,3.95,337,"",{"$f":"VLOOKUP(EpisodeList[[#This Row],[Season Number]], INDIRECT(\"'\" & EpisodeList[[#This Row],[Show]] & \" Season Info'!C2:J15\"), 8,1)","v":"2010-11"}]
["30 Rock","Season 5",5,{"$f":"A339& \" S\" &C339","v":"30 Rock S5"},102,22,"\"Everything Sunny All the Time Always\"","John Riggi","Kay Cannon & Matt Hubbard","2011-04-28",{"$f":"CHOOSE(WEEKDAY(J339),\"Sun\",\"Mon\",\"Tue\",\"Wed\",\"Thu\",\"Fri\",\"Sat\")","v":"Thu"},"23:00:00",522,3.95,338,"",{"$f":"VLOOKUP(EpisodeList[[#This Row],[Season Number]], INDIRECT(\"'\" & EpisodeList[[#This Row],[Show]] & \" Season Info'!C2:J15\"), 8,1)","v":"2010-11"}]
["Community","Season 2",2,{"$f":"A340& \" S\" &C340","v":"Community S2"},48,23,"\"A Fistful of Paintballs\"","Joe Russo","Andrew Guest","2011-05-05",{"$f":"CHOOSE(WEEKDAY(J340),\"Sun\",\"Mon\",\"Tue\",\"Wed\",\"Thu\",\"Fri\",\"Sat\")","v":"Thu"},"20:00:00",223,3.49,339,"Yes",{"$f":"VLOOKUP(EpisodeList[[#This Row],[Season Number]], INDIRECT(\"'\" & EpisodeList[[#This Row],[Show]] & \" Season Info'!C2:J15\"), 8,1)","v":"2010-11"}]
["The Office","Season 7",7,{"$f":"A341& \" S\" &C341","v":"The Office S7"},149,23,"\"The Inner Circle\"","Matt Sohn","Charlie Grandy","2011-05-05",{"$f":"CHOOSE(WEEKDAY(J341),\"Sun\",\"Mon\",\"Tue\",\"Wed\",\"Thu\",\"Fri\",\"Sat\")","v":"Thu"},"21:00:00",7023,6.9,340,"Yes",{"$f":"VLOOKUP(EpisodeList[[#This Row],[Season Number]], INDIRECT(\"'\" & EpisodeList[[#This Row],[Show]] & \" Season Info'!C2:J15\"), 8,1)","v":"2010-11"}]
["Parks and Rec","Season 3",3,{"$f":"A342& \" S\" &C342","v":"Parks and Rec S3"},42,12,"\"Eagleton\"","Nicole Holofcener","Emily Spivey","2011-05-05",{"$f":"CHOOSE(WEEKDAY(J342),\"Sun\",\"Mon\",\"Tue\",\"Wed\",\"Thu\",\"Fri\",\"Sat\")","v":"Thu"},"21:30:00",null,5.0599999999999996,341,"Yes",{"$f":"VLOOKUP(EpisodeList[[#This Row],[Season Number]], INDIRECT(\"'\" & EpisodeList[[#This Row],[Show]] & \" Season Info'!C2:J15\"), 8,1)","v":"2010-11"}]
["30 Rock","Season 5",5,{"$f":"A343& \" S\" &C343","v":"30 Rock S5"},103,23,"\"Respawn\"","Don Scardino","Hannibal Buress & Ron Weiner","2011-05-05",{"$f":"CHOOSE(WEEKDAY(J343),\"Sun\",\"Mon\",\"Tue\",\"Wed\",\"Thu\",\"Fri\",\"Sat\")","v":"Thu"},"22:00:00",523,4.2,342,"Yes",{"$f":"VLOOKUP(EpisodeList[[#This Row],[Season Number]], INDIRECT(\"'\" & EpisodeList[[#This Row],[Show]] & \" Season Info'!C2:J15\"), 8,1)","v":"2010-11"}]
["Community","Season 2",2,{"$f":"A344& \" S\" &C344","v":"Community S2"},49,24,"\"For a Few Paintballs More\"","Joe Russo","Hilary Winston","2011-05-12",{"$f":"CHOOSE(WEEKDAY(J344),\"Sun\",\"Mon\",\"Tue\",\"Wed\",\"Thu\",\"Fri\",\"Sat\")","v":"Thu"},"20:00:00",224,3.32,343,"",{"$f":"VLOOKUP(EpisodeList[[#This Row],[Season Number]], INDIRECT(\"'\" & EpisodeList[[#This Row],[Show]] & \" Season Info'!C2:J15\"), 8,1)","v":"2010-11"}]
["The Office","Season 7",7,{"$f":"A345& \" S\" &C345","v":"The Office S7"},150,24,"\"Dwight K. Schrute, (Acting) Manager\"","Troy Miller","Justin Spitzer","2011-05-12",{"$f":"CHOOSE(WEEKDAY(J345),\"Sun\",\"Mon\",\"Tue\",\"Wed\",\"Thu\",\"Fri\",\"Sat\")","v":"Thu"},"21:00:00",7024,6.45,344,"",{"$f":"VLOOKUP(EpisodeList[[#This Row],[Season Number]], INDIRECT(\"'\" & EpisodeList[[#This Row],[Show]] & \" Season Info'!C2:J15\"), 8,1)","v":"2010-11"}]
["Parks and Rec","Season 3",3,{"$f":"A346& \" S\" &C346","v":"Parks and Rec S3"},43,13,"\"The Fight\"","Randall Einhorn","Amy Poehler","2011-05-12",{"$f":"CHOOSE(WEEKDAY(J346),\"Sun\",\"Mon\",\"Tue\",\"Wed\",\"Thu\",\"Fri\",\"Sat\")","v":"Thu"},"21:30:00",null,4.55,345,"",{"$f":"VLOOKUP(EpisodeList[[#This Row],[Season Number]], INDIRECT(\"'\" & EpisodeList[[#This Row],[Show]] & \" Season Info'!C2:J15\"), 8,1)","v":"2010-11"}]
["Parks and Rec","Season 3",3,{"$f":"A347& \" S\" &C347","v":"Parks and Rec S3"},44,14,"\"Road Trip\"","Troy Miller","Harris Wittels","2011-05-12",{"$f":"CHOOSE(WEEKDAY(J347),\"Sun\",\"Mon\",\"Tue\",\"Wed\",\"Thu\",\"Fri\",\"Sat\")","v":"Thu"},"22:00:00",null,3.54,346,"",{"$f":"VLOOKUP(EpisodeList[[#This Row],[Season Number]], INDIRECT(\"'\" & EpisodeList[[#This Row],[Show]] & \" Season Info'!C2:J15\"), 8,1)","v":"2010-11"}]
["The Office","Season 7",7,{"$f":"A348& \" S\" &C348","v":"The Office S7"},151,25,"\"Search Committee\"","Jeffrey Blitz","Paul Lieberstein","2011-05-19",{"$f":"CHOOSE(WEEKDAY(J348),\"Sun\",\"Mon\",\"Tue\",\"Wed\",\"Thu\",\"Fri\",\"Sat\")","v":"Thu"},"21:00:00",7025,7.29,347,"",{"$f":"VLOOKUP(EpisodeList[[#This Row],[Season Number]], INDIRECT(\"'\" & EpisodeList[[#This Row],[Show]] & \" Season Info'!C2:J15\"), 8,1)","v":"2010-11"}]
["The Office","Season 7",7,{"$f":"A349& \" S\" &C349","v":"The Office S7"},152,26,"\"Search Committee\"","Jeffrey Blitz","Paul Lieberstein","2011-05-19",{"$f":"CHOOSE(WEEKDAY(J349),\"Sun\",\"Mon\",\"Tue\",\"Wed\",\"Thu\",\"Fri\",\"Sat\")","v":"Thu"},"21:30:00",7026,7.29,348,"",{"$f":"VLOOKUP(EpisodeList[[#This Row],[Season Number]], INDIRECT(\"'\" & EpisodeList[[#This Row],[Show]] & \" Season Info'!C2:J15\"), 8,1)","v":"2010-11"}]
["Parks and Rec","Season 3",3,{"$f":"A350& \" S\" &C350","v":"Parks and Rec S3"},45,15,"\"The Bubble\"","Matt Sohn","Greg Levine & Brian Rowe","2011-05-19",{"$f":"CHOOSE(WEEKDAY(J350),\"Sun\",\"Mon\",\"Tue\",\"Wed\",\"Thu\",\"Fri\",\"Sat\")","v":"Thu"},"22:00:00",null,4.2699999999999996,349,"",{"$f":"VLOOKUP(EpisodeList[[#This Row],[Season Number]], INDIRECT(\"'\" & EpisodeList[[#This Row],[Show]] & \" Season Info'!C2:J15\"), 8,1)","v":"2010-11"}]
["Parks and Rec","Season 3",3,{"$f":"A351& \" S\" &C351","v":"Parks and Rec S3"},46,16,"\"Li'l Sebastian\"","Dean Holland","Dan Goor","2011-05-19",{"$f":"CHOOSE(WEEKDAY(J351),\"Sun\",\"Mon\",\"Tue\",\"Wed\",\"Thu\",\"Fri\",\"Sat\")","v":"Thu"},"22:30:00",null,3.72,350,"",{"$f":"VLOOKUP(EpisodeList[[#This Row],[Season Number]], INDIRECT(\"'\" & EpisodeList[[#This Row],[Show]] & \" Season Info'!C2:J15\"), 8,1)","v":"2010-11"}]
["Community","Season 3",3,{"$f":"A352& \" S\" &C352","v":"Community S3"},50,1,"\"Biology 101\"","Anthony Russo","Garrett Donovan & Neil Goldman","2011-09-22",{"$f":"CHOOSE(WEEKDAY(J352),\"Sun\",\"Mon\",\"Tue\",\"Wed\",\"Thu\",\"Fri\",\"Sat\")","v":"Thu"},"20:00:00",301,3.93,351,"",{"$f":"VLOOKUP(EpisodeList[[#This Row],[Season Number]], INDIRECT(\"'\" & EpisodeList[[#This Row],[Show]] & \" Season Info'!C2:J15\"), 8,1)","v":"2011-12"}]
["Parks and Rec","Season 4",4,{"$f":"A353& \" S\" &C353","v":"Parks and Rec S4"},47,1,"\"I'm Leslie Knope\"","Troy Miller","Dan Goor","2011-09-22",{"$f":"CHOOSE(WEEKDAY(J353),\"Sun\",\"Mon\",\"Tue\",\"Wed\",\"Thu\",\"Fri\",\"Sat\")","v":"Thu"},"20:30:00",null,4.1100000000000003,352,"",{"$f":"VLOOKUP(EpisodeList[[#This Row],[Season Number]], INDIRECT(\"'\" & EpisodeList[[#This Row],[Show]] & \" Season Info'!C2:J15\"), 8,1)","v":"2011-12"}]
["The Office","Season 8",8,{"$f":"A354& \" S\" &C354","v":"The Office S8"},153,1,"\"The List\"","B. J. Novak","B. J. Novak","2011-09-22",{"$f":"CHOOSE(WEEKDAY(J354),\"Sun\",\"Mon\",\"Tue\",\"Wed\",\"Thu\",\"Fri\",\"Sat\")","v":"Thu"},"21:00:00",8002,7.64,353,"",{"$f":"VLOOKUP(EpisodeList[[#This Row],[Season Number]], INDIRECT(\"'\" & EpisodeList[[#This Row],[Show]] & \" Season Info'!C2:J15\"), 8,1)","v":"2011-12"}]
["Community","Season 3",3,{"$f":"A355& \" S\" &C355","v":"Community S3"},51,2,"\"Geography of Global Conflict\"","Joe Russo","Andy Bobrow","2011-09-29",{"$f":"CHOOSE(WEEKDAY(J355),\"Sun\",\"Mon\",\"Tue\",\"Wed\",\"Thu\",\"Fri\",\"Sat\")","v":"Thu"},"20:00:00",302,3.98,354,"",{"$f":"VLOOKUP(EpisodeList[[#This Row],[Season Number]], INDIRECT(\"'\" & EpisodeList[[#This Row],[Show]] & \" Season Info'!C2:J15\"), 8,1)","v":"2011-12"}]
["Parks and Rec","Season 4",4,{"$f":"A356& \" S\" &C356","v":"Parks and Rec S4"},48,2,"\"Ron and Tammys\"","Randall Einhorn","Norm Hiscock","2011-09-29",{"$f":"CHOOSE(WEEKDAY(J356),\"Sun\",\"Mon\",\"Tue\",\"Wed\",\"Thu\",\"Fri\",\"Sat\")","v":"Thu"},"20:30:00",null,4.33,355,"",{"$f":"VLOOKUP(EpisodeList[[#This Row],[Season Number]], INDIRECT(\"'\" & EpisodeList[[#This Row],[Show]] & \" Season Info'!C2:J15\"), 8,1)","v":"2011-12"}]
["The Office","Season 8",8,{"$f":"A357& \" S\" &C357","v":"The Office S8"},154,2,"\"The Incentive\"","Charles McDougall","Paul Lieberstein","2011-09-29",{"$f":"CHOOSE(WEEKDAY(J357),\"Sun\",\"Mon\",\"Tue\",\"Wed\",\"Thu\",\"Fri\",\"Sat\")","v":"Thu"},"21:00:00",8001,6.7,356,"",{"$f":"VLOOKUP(EpisodeList[[#This Row],[Season Number]], INDIRECT(\"'\" & EpisodeList[[#This Row],[Show]] & \" Season Info'!C2:J15\"), 8,1)","v":"2011-12"}]
["Community","Season 3",3,{"$f":"A358& \" S\" &C358","v":"Community S3"},52,3,"\"Competitive Ecology\"","Anthony Russo","Maggie Bandur","2011-10-06",{"$f":"CHOOSE(WEEKDAY(J358),\"Sun\",\"Mon\",\"Tue\",\"Wed\",\"Thu\",\"Fri\",\"Sat\")","v":"Thu"},"20:00:00",304,3.35,357,"",{"$f":"VLOOKUP(EpisodeList[[#This Row],[Season Number]], INDIRECT(\"'\" & EpisodeList[[#This Row],[Show]] & \" Season Info'!C2:J15\"), 8,1)","v":"2011-12"}]
["Parks and Rec","Season 4",4,{"$f":"A359& \" S\" &C359","v":"Parks and Rec S4"},49,3,"\"Born & Raised\"","Dean Holland","Aisha Muharrar","2011-10-06",{"$f":"CHOOSE(WEEKDAY(J359),\"Sun\",\"Mon\",\"Tue\",\"Wed\",\"Thu\",\"Fri\",\"Sat\")","v":"Thu"},"20:30:00",null,4.1500000000000004,358,"",{"$f":"VLOOKUP(EpisodeList[[#This Row],[Season Number]], INDIRECT(\"'\" & EpisodeList[[#This Row],[Show]] & \" Season Info'!C2:J15\"), 8,1)","v":"2011-12"}]
["The Office","Season 8",8,{"$f":"A360& \" S\" &C360","v":"The Office S8"},155,3,"\"Lotto\"","John Krasinski","Charlie Grandy","2011-10-06",{"$f":"CHOOSE(WEEKDAY(J360),\"Sun\",\"Mon\",\"Tue\",\"Wed\",\"Thu\",\"Fri\",\"Sat\")","v":"Thu"},"21:00:00",8005,5.82,359,"",{"$f":"VLOOKUP(EpisodeList[[#This Row],[Season Number]], INDIRECT(\"'\" & EpisodeList[[#This Row],[Show]] & \" Season Info'!C2:J15\"), 8,1)","v":"2011-12"}]
["Community","Season 3",3,{"$f":"A361& \" S\" &C361","v":"Community S3"},53,4,"\"Remedial Chaos Theory\"","Jeff Melman","Chris McKenna","2011-10-13",{"$f":"CHOOSE(WEEKDAY(J361),\"Sun\",\"Mon\",\"Tue\",\"Wed\",\"Thu\",\"Fri\",\"Sat\")","v":"Thu"},"20:00:00",303,3.78,360,"",{"$f":"VLOOKUP(EpisodeList[[#This Row],[Season Number]], INDIRECT(\"'\" & EpisodeList[[#This Row],[Show]] & \" Season Info'!C2:J15\"), 8,1)","v":"2011-12"}]
["Parks and Rec","Season 4",4,{"$f":"A362& \" S\" &C362","v":"Parks and Rec S4"},50,4,"\"Pawnee Rangers\"","Charles McDougall","Alan Yang","2011-10-13",{"$f":"CHOOSE(WEEKDAY(J362),\"Sun\",\"Mon\",\"Tue\",\"Wed\",\"Thu\",\"Fri\",\"Sat\")","v":"Thu"},"20:30:00",null,3.99,361,"",{"$f":"VLOOKUP(EpisodeList[[#This Row],[Season Number]], INDIRECT(\"'\" & EpisodeList[[#This Row],[Show]] & \" Season Info'!C2:J15\"), 8,1)","v":"2011-12"}]
["The Office","Season 8",8,{"$f":"A363& \" S\" &C363","v":"The Office S8"},156,4,"\"Garden Party\"","David Rogers","Justin Spitzer","2011-10-13",{"$f":"CHOOSE(WEEKDAY(J363),\"Sun\",\"Mon\",\"Tue\",\"Wed\",\"Thu\",\"Fri\",\"Sat\")","v":"Thu"},"21:00:00",8004,6.08,362,"",{"$f":"VLOOKUP(EpisodeList[[#This Row],[Season Number]], INDIRECT(\"'\" & EpisodeList[[#This Row],[Show]] & \" Season Info'!C2:J15\"), 8,1)","v":"2011-12"}]
["Community","Season 3",3,{"$f":"A364& \" S\" &C364","v":"Community S3"},54,5,"\"Horror Fiction in Seven Spooky Steps\"","Tristram Shapeero","Dan Harmon","2011-10-27",{"$f":"CHOOSE(WEEKDAY(J364),\"Sun\",\"Mon\",\"Tue\",\"Wed\",\"Thu\",\"Fri\",\"Sat\")","v":"Thu"},"20:00:00",305,3.42,363,"",{"$f":"VLOOKUP(EpisodeList[[#This Row],[Season Number]], INDIRECT(\"'\" & EpisodeList[[#This Row],[Show]] & \" Season Info'!C2:J15\"), 8,1)","v":"2011-12"}]
["Parks and Rec","Season 4",4,{"$f":"A365& \" S\" &C365","v":"Parks and Rec S4"},51,5,"\"Meet n Greet\"","Wendey Stanzler","Katie Dippold","2011-10-27",{"$f":"CHOOSE(WEEKDAY(J365),\"Sun\",\"Mon\",\"Tue\",\"Wed\",\"Thu\",\"Fri\",\"Sat\")","v":"Thu"},"20:30:00",null,3.9,364,"",{"$f":"VLOOKUP(EpisodeList[[#This Row],[Season Number]], INDIRECT(\"'\" & EpisodeList[[#This Row],[Show]] & \" Season Info'!C2:J15\"), 8,1)","v":"2011-12"}]
["The Office","Season 8",8,{"$f":"A366& \" S\" &C366","v":"The Office S8"},157,5,"\"Spooked\"","Randall Einhorn","Carrie Kemper","2011-10-27",{"$f":"CHOOSE(WEEKDAY(J366),\"Sun\",\"Mon\",\"Tue\",\"Wed\",\"Thu\",\"Fri\",\"Sat\")","v":"Thu"},"21:00:00",8006,5.53,365,"",{"$f":"VLOOKUP(EpisodeList[[#This Row],[Season Number]], INDIRECT(\"'\" & EpisodeList[[#This Row],[Show]] & \" Season Info'!C2:J15\"), 8,1)","v":"2011-12"}]
["Community","Season 3",3,{"$f":"A367& \" S\" &C367","v":"Community S3"},55,6,"\"Advanced Gay\"","Joe Russo","Matt Murray","2011-11-03",{"$f":"CHOOSE(WEEKDAY(J367),\"Sun\",\"Mon\",\"Tue\",\"Wed\",\"Thu\",\"Fri\",\"Sat\")","v":"Thu"},"20:00:00",306,3.84,366,"",{"$f":"VLOOKUP(EpisodeList[[#This Row],[Season Number]], INDIRECT(\"'\" & EpisodeList[[#This Row],[Show]] & \" Season Info'!C2:J15\"), 8,1)","v":"2011-12"}]
["Parks and Rec","Season 4",4,{"$f":"A368& \" S\" &C368","v":"Parks and Rec S4"},52,6,"\"End of the World\"","Dean Holland","Michael Schur","2011-11-03",{"$f":"CHOOSE(WEEKDAY(J368),\"Sun\",\"Mon\",\"Tue\",\"Wed\",\"Thu\",\"Fri\",\"Sat\")","v":"Thu"},"20:30:00",null,4,367,"",{"$f":"VLOOKUP(EpisodeList[[#This Row],[Season Number]], INDIRECT(\"'\" & EpisodeList[[#This Row],[Show]] & \" Season Info'!C2:J15\"), 8,1)","v":"2011-12"}]
["The Office","Season 8",8,{"$f":"A369& \" S\" &C369","v":"The Office S8"},158,6,"\"Doomsday\"","Troy Miller","Daniel Chun","2011-11-03",{"$f":"CHOOSE(WEEKDAY(J369),\"Sun\",\"Mon\",\"Tue\",\"Wed\",\"Thu\",\"Fri\",\"Sat\")","v":"Thu"},"21:00:00",8003,6.15,368,"",{"$f":"VLOOKUP(EpisodeList[[#This Row],[Season Number]], INDIRECT(\"'\" & EpisodeList[[#This Row],[Show]] & \" Season Info'!C2:J15\"), 8,1)","v":"2011-12"}]
["Community","Season 3",3,{"$f":"A370& \" S\" &C370","v":"Community S3"},56,7,"\"Studies in Modern Movement\"","Tristram Shapeero","Adam Countee","2011-11-10",{"$f":"CHOOSE(WEEKDAY(J370),\"Sun\",\"Mon\",\"Tue\",\"Wed\",\"Thu\",\"Fri\",\"Sat\")","v":"Thu"},"20:00:00",307,3.49,369,"",{"$f":"VLOOKUP(EpisodeList[[#This Row],[Season Number]], INDIRECT(\"'\" & EpisodeList[[#This Row],[Show]] & \" Season Info'!C2:J15\"), 8,1)","v":"2011-12"}]
["Parks and Rec","Season 4",4,{"$f":"A371& \" S\" &C371","v":"Parks and Rec S4"},53,7,"\"The Treaty\"","Jorma Taccone","Harris Wittels","2011-11-10",{"$f":"CHOOSE(WEEKDAY(J371),\"Sun\",\"Mon\",\"Tue\",\"Wed\",\"Thu\",\"Fri\",\"Sat\")","v":"Thu"},"20:30:00",null,3.66,370,"",{"$f":"VLOOKUP(EpisodeList[[#This Row],[Season Number]], INDIRECT(\"'\" & EpisodeList[[#This Row],[Show]] & \" Season Info'!C2:J15\"), 8,1)","v":"2011-12"}]
["The Office","Season 8",8,{"$f":"A372& \" S\" &C372","v":"The Office S8"},159,7,"\"Pam's Replacement\"","Matt Sohn","Allison Silverman","2011-11-10",{"$f":"CHOOSE(WEEKDAY(J372),\"Sun\",\"Mon\",\"Tue\",\"Wed\",\"Thu\",\"Fri\",\"Sat\")","v":"Thu"},"21:00:00",8007,5.96,371,"",{"$f":"VLOOKUP(EpisodeList[[#This Row],[Season Number]], INDIRECT(\"'\" & EpisodeList[[#This Row],[Show]] & \" Season Info'!C2:J15\"), 8,1)","v":"2011-12"}]
["Community","Season 3",3,{"$f":"A373& \" S\" &C373","v":"Community S3"},57,8,"\"Documentary Filmmaking: Redux\"","Joe Russo","Megan Ganz","2011-11-17",{"$f":"CHOOSE(WEEKDAY(J373),\"Sun\",\"Mon\",\"Tue\",\"Wed\",\"Thu\",\"Fri\",\"Sat\")","v":"Thu"},"20:00:00",308,3.62,372,"",{"$f":"VLOOKUP(EpisodeList[[#This Row],[Season Number]], INDIRECT(\"'\" & EpisodeList[[#This Row],[Show]] & \" Season Info'!C2:J15\"), 8,1)","v":"2011-12"}]
["Parks and Rec","Season 4",4,{"$f":"A374& \" S\" &C374","v":"Parks and Rec S4"},54,8,"\"Smallest Park\"","Nicole Holofcener","Chelsea Peretti","2011-11-17",{"$f":"CHOOSE(WEEKDAY(J374),\"Sun\",\"Mon\",\"Tue\",\"Wed\",\"Thu\",\"Fri\",\"Sat\")","v":"Thu"},"20:30:00",null,3.68,373,"",{"$f":"VLOOKUP(EpisodeList[[#This Row],[Season Number]], INDIRECT(\"'\" & EpisodeList[[#This Row],[Show]] & \" Season Info'!C2:J15\"), 8,1)","v":"2011-12"}]
["The Office","Season 8",8,{"$f":"A375& \" S\" &C375","v":"The Office S8"},160,8,"\"Gettysburg\"","Jeffrey Blitz","Robert Padnick","2011-11-17",{"$f":"CHOOSE(WEEKDAY(J375),\"Sun\",\"Mon\",\"Tue\",\"Wed\",\"Thu\",\"Fri\",\"Sat\")","v":"Thu"},"21:00:00",8008,5.5,374,"",{"$f":"VLOOKUP(EpisodeList[[#This Row],[Season Number]], INDIRECT(\"'\" & EpisodeList[[#This Row],[Show]] & \" Season Info'!C2:J15\"), 8,1)","v":"2011-12"}]
["Community","Season 3",3,{"$f":"A376& \" S\" &C376","v":"Community S3"},58,9,"\"Foosball and Nocturnal Vigilantism\"","Anthony Russo","Chris Kula","2011-12-01",{"$f":"CHOOSE(WEEKDAY(J376),\"Sun\",\"Mon\",\"Tue\",\"Wed\",\"Thu\",\"Fri\",\"Sat\")","v":"Thu"},"20:00:00",309,3.74,375,"",{"$f":"VLOOKUP(EpisodeList[[#This Row],[Season Number]], INDIRECT(\"'\" & EpisodeList[[#This Row],[Show]] & \" Season Info'!C2:J15\"), 8,1)","v":"2011-12"}]
["Parks and Rec","Season 4",4,{"$f":"A377& \" S\" &C377","v":"Parks and Rec S4"},55,9,"\"The Trial of Leslie Knope\"","Dean Holland","Dan Goor & Michael Schur","2011-12-01",{"$f":"CHOOSE(WEEKDAY(J377),\"Sun\",\"Mon\",\"Tue\",\"Wed\",\"Thu\",\"Fri\",\"Sat\")","v":"Thu"},"20:30:00",null,3.69,376,"",{"$f":"VLOOKUP(EpisodeList[[#This Row],[Season Number]], INDIRECT(\"'\" & EpisodeList[[#This Row],[Show]] & \" Season Info'!C2:J15\"), 8,1)","v":"2011-12"}]
["The Office","Season 8",8,{"$f":"A378& \" S\" &C378","v":"The Office S8"},161,9,"\"Mrs. California\"","Charlie Grandy","Dan Greaney","2011-12-01",{"$f":"CHOOSE(WEEKDAY(J378),\"Sun\",\"Mon\",\"Tue\",\"Wed\",\"Thu\",\"Fri\",\"Sat\")","v":"Thu"},"21:00:00",8009,5.71,377,"",{"$f":"VLOOKUP(EpisodeList[[#This Row],[Season Number]], INDIRECT(\"'\" & EpisodeList[[#This Row],[Show]] & \" Season Info'!C2:J15\"), 8,1)","v":"2011-12"}]
["Community","Season 3",3,{"$f":"A379& \" S\" &C379","v":"Community S3"},59,10,"\"Regional Holiday Music\"","Tristram Shapeero","Steve Basilone & Annie Mebane","2011-12-08",{"$f":"CHOOSE(WEEKDAY(J379),\"Sun\",\"Mon\",\"Tue\",\"Wed\",\"Thu\",\"Fri\",\"Sat\")","v":"Thu"},"20:00:00",311,3.6,378,"",{"$f":"VLOOKUP(EpisodeList[[#This Row],[Season Number]], INDIRECT(\"'\" & EpisodeList[[#This Row],[Show]] & \" Season Info'!C2:J15\"), 8,1)","v":"2011-12"}]
["Parks and Rec","Season 4",4,{"$f":"A380& \" S\" &C380","v":"Parks and Rec S4"},56,10,"\"Citizen Knope\"","Randall Einhorn","Dave King","2011-12-08",{"$f":"CHOOSE(WEEKDAY(J380),\"Sun\",\"Mon\",\"Tue\",\"Wed\",\"Thu\",\"Fri\",\"Sat\")","v":"Thu"},"20:30:00",null,3.64,379,"",{"$f":"VLOOKUP(EpisodeList[[#This Row],[Season Number]], INDIRECT(\"'\" & EpisodeList[[#This Row],[Show]] & \" Season Info'!C2:J15\"), 8,1)","v":"2011-12"}]
["The Office","Season 8",8,{"$f":"A381& \" S\" &C381","v":"The Office S8"},162,10,"\"Christmas Wishes\"","Ed Helms","Mindy Kaling","2011-12-08",{"$f":"CHOOSE(WEEKDAY(J381),\"Sun\",\"Mon\",\"Tue\",\"Wed\",\"Thu\",\"Fri\",\"Sat\")","v":"Thu"},"21:00:00",8010,5.79,380,"",{"$f":"VLOOKUP(EpisodeList[[#This Row],[Season Number]], INDIRECT(\"'\" & EpisodeList[[#This Row],[Show]] & \" Season Info'!C2:J15\"), 8,1)","v":"2011-12"}]
["30 Rock","Season 6",6,{"$f":"A382& \" S\" &C382","v":"30 Rock S6"},104,1,"\"Dance Like Nobody's Watching\"","John Riggi","Tina Fey & Tracey Wigfield","2012-01-12",{"$f":"CHOOSE(WEEKDAY(J382),\"Sun\",\"Mon\",\"Tue\",\"Wed\",\"Thu\",\"Fri\",\"Sat\")","v":"Thu"},"20:00:00",601,4.47,381,"",{"$f":"VLOOKUP(EpisodeList[[#This Row],[Season Number]], INDIRECT(\"'\" & EpisodeList[[#This Row],[Show]] & \" Season Info'!C2:J15\"), 8,1)","v":"2011-12"}]
["The Office","Season 8",8,{"$f":"A383& \" S\" &C383","v":"The Office S8"},163,11,"\"Trivia\"","B. J. Novak","Steve Hely","2012-01-12",{"$f":"CHOOSE(WEEKDAY(J383),\"Sun\",\"Mon\",\"Tue\",\"Wed\",\"Thu\",\"Fri\",\"Sat\")","v":"Thu"},"21:00:00",8011,5.9,382,"",{"$f":"VLOOKUP(EpisodeList[[#This Row],[Season Number]], INDIRECT(\"'\" & EpisodeList[[#This Row],[Show]] & \" Season Info'!C2:J15\"), 8,1)","v":"2011-12"}]
["Parks and Rec","Season 4",4,{"$f":"A384& \" S\" &C384","v":"Parks and Rec S4"},57,11,"\"The Comeback Kid\"","Tucker Gates","Mike Scully","2012-01-12",{"$f":"CHOOSE(WEEKDAY(J384),\"Sun\",\"Mon\",\"Tue\",\"Wed\",\"Thu\",\"Fri\",\"Sat\")","v":"Thu"},"21:30:00",null,4.09,383,"",{"$f":"VLOOKUP(EpisodeList[[#This Row],[Season Number]], INDIRECT(\"'\" & EpisodeList[[#This Row],[Show]] & \" Season Info'!C2:J15\"), 8,1)","v":"2011-12"}]
["30 Rock","Season 6",6,{"$f":"A385& \" S\" &C385","v":"30 Rock S6"},105,2,"\"Idiots Are People Two!\"","Beth McCarthy-Miller","Robert Carlock","2012-01-19",{"$f":"CHOOSE(WEEKDAY(J385),\"Sun\",\"Mon\",\"Tue\",\"Wed\",\"Thu\",\"Fri\",\"Sat\")","v":"Thu"},"20:00:00",602,4.05,384,"",{"$f":"VLOOKUP(EpisodeList[[#This Row],[Season Number]], INDIRECT(\"'\" & EpisodeList[[#This Row],[Show]] & \" Season Info'!C2:J15\"), 8,1)","v":"2011-12"}]
["The Office","Season 8",8,{"$f":"A386& \" S\" &C386","v":"The Office S8"},164,12,"\"Pool Party\"","Charles McDougall","Owen Ellickson","2012-01-19",{"$f":"CHOOSE(WEEKDAY(J386),\"Sun\",\"Mon\",\"Tue\",\"Wed\",\"Thu\",\"Fri\",\"Sat\")","v":"Thu"},"21:00:00",8012,6.02,385,{"$f":"IF(AND(\n    COUNTIFS(A:A, A386, J:J, J386) = 1,\n    COUNTIFS(A:A, \"30 Rock\", J:J, J386) = 1,\n    COUNTIFS(A:A, \"The Office\", J:J, J386) = 1,\n    COUNTIFS(A:A, \"Community\", J:J, J386) = 1,\n    COUNTIFS(A:A, \"Parks and Rec\", J:J, J386) = 1\n), \"Yes\", \"\")","v":""},{"$f":"VLOOKUP(EpisodeList[[#This Row],[Season Number]], INDIRECT(\"'\" & EpisodeList[[#This Row],[Show]] & \" Season Info'!C2:J15\"), 8,1)","v":"2011-12"}]
["Parks and Rec","Season 4",4,{"$f":"A387& \" S\" &C387","v":"Parks and Rec S4"},58,12,"\"Campaign Ad\"","Dean Holland","Alan Yang","2012-01-19",{"$f":"CHOOSE(WEEKDAY(J387),\"Sun\",\"Mon\",\"Tue\",\"Wed\",\"Thu\",\"Fri\",\"Sat\")","v":"Thu"},"21:30:00",null,4.25,386,"",{"$f":"VLOOKUP(EpisodeList[[#This Row],[Season Number]], INDIRECT(\"'\" & EpisodeList[[#This Row],[Show]] & \" Season Info'!C2:J15\"), 8,1)","v":"2011-12"}]
["30 Rock","Season 6",6,{"$f":"A388& \" S\" &C388","v":"30 Rock S6"},106,3,"\"Idiots Are People Three!\"","Beth McCarthy-Miller","Robert Carlock","2012-01-26",{"$f":"CHOOSE(WEEKDAY(J388),\"Sun\",\"Mon\",\"Tue\",\"Wed\",\"Thu\",\"Fri\",\"Sat\")","v":"Thu"},"21:00:00",603,3.82,387,"",{"$f":"VLOOKUP(EpisodeList[[#This Row],[Season Number]], INDIRECT(\"'\" & EpisodeList[[#This Row],[Show]] & \" Season Info'!C2:J15\"), 8,1)","v":"2011-12"}]
["Parks and Rec","Season 4",4,{"$f":"A389& \" S\" &C389","v":"Parks and Rec S4"},59,13,"\"Bowling for Votes\"","Michael Trim","Katie Dippold","2012-01-26",{"$f":"CHOOSE(WEEKDAY(J389),\"Sun\",\"Mon\",\"Tue\",\"Wed\",\"Thu\",\"Fri\",\"Sat\")","v":"Thu"},"21:30:00",null,3.49,388,"",{"$f":"VLOOKUP(EpisodeList[[#This Row],[Season Number]], INDIRECT(\"'\" & EpisodeList[[#This Row],[Show]] & \" Season Info'!C2:J15\"), 8,1)","v":"2011-12"}]
["30 Rock","Season 6",6,{"$f":"A390& \" S\" &C390","v":"30 Rock S6"},107,4,"\"The Ballad of Kenneth Parcell\"","Jeff Richmond","Matt Hubbard","2012-01-26",{"$f":"CHOOSE(WEEKDAY(J390),\"Sun\",\"Mon\",\"Tue\",\"Wed\",\"Thu\",\"Fri\",\"Sat\")","v":"Thu"},"21:30:00",604,3.98,389,"",{"$f":"VLOOKUP(EpisodeList[[#This Row],[Season Number]], INDIRECT(\"'\" & EpisodeList[[#This Row],[Show]] & \" Season Info'!C2:J15\"), 8,1)","v":"2011-12"}]
["30 Rock","Season 6",6,{"$f":"A391& \" S\" &C391","v":"30 Rock S6"},108,5,"\"Today You Are a Man\"","Jeff Richmond","Ron Weiner","2012-02-02",{"$f":"CHOOSE(WEEKDAY(J391),\"Sun\",\"Mon\",\"Tue\",\"Wed\",\"Thu\",\"Fri\",\"Sat\")","v":"Thu"},"20:00:00",605,3.23,390,"",{"$f":"VLOOKUP(EpisodeList[[#This Row],[Season Number]], INDIRECT(\"'\" & EpisodeList[[#This Row],[Show]] & \" Season Info'!C2:J15\"), 8,1)","v":"2011-12"}]
["The Office","Season 8",8,{"$f":"A392& \" S\" &C392","v":"The Office S8"},165,13,"\"Jury Duty\"","Eric Appel","Aaron Shure","2012-02-02",{"$f":"CHOOSE(WEEKDAY(J392),\"Sun\",\"Mon\",\"Tue\",\"Wed\",\"Thu\",\"Fri\",\"Sat\")","v":"Thu"},"21:00:00",8013,5.31,391,"",{"$f":"VLOOKUP(EpisodeList[[#This Row],[Season Number]], INDIRECT(\"'\" & EpisodeList[[#This Row],[Show]] & \" Season Info'!C2:J15\"), 8,1)","v":"2011-12"}]
["Parks and Rec","Season 4",4,{"$f":"A393& \" S\" &C393","v":"Parks and Rec S4"},60,14,"\"Operation Ann\"","Morgan Sackett","Aisha Muharrar","2012-02-02",{"$f":"CHOOSE(WEEKDAY(J393),\"Sun\",\"Mon\",\"Tue\",\"Wed\",\"Thu\",\"Fri\",\"Sat\")","v":"Thu"},"21:30:00",null,3.6,392,"",{"$f":"VLOOKUP(EpisodeList[[#This Row],[Season Number]], INDIRECT(\"'\" & EpisodeList[[#This Row],[Show]] & \" Season Info'!C2:J15\"), 8,1)","v":"2011-12"}]
["30 Rock","Season 6",6,{"$f":"A394& \" S\" &C394","v":"30 Rock S6"},109,6,"\"Hey, Baby, What's Wrong\"","Michael Engler","Kay Cannon","2012-02-09",{"$f":"CHOOSE(WEEKDAY(J394),\"Sun\",\"Mon\",\"Tue\",\"Wed\",\"Thu\",\"Fri\",\"Sat\")","v":"Thu"},"20:00:00",606,3.88,393,"",{"$f":"VLOOKUP(EpisodeList[[#This Row],[Season Number]], INDIRECT(\"'\" & EpisodeList[[#This Row],[Show]] & \" Season Info'!C2:J15\"), 8,1)","v":"2011-12"}]
["The Office","Season 8",8,{"$f":"A395& \" S\" &C395","v":"The Office S8"},166,14,"\"Special Project\"","David Rogers","Amelie Gillette","2012-02-09",{"$f":"CHOOSE(WEEKDAY(J395),\"Sun\",\"Mon\",\"Tue\",\"Wed\",\"Thu\",\"Fri\",\"Sat\")","v":"Thu"},"21:00:00",8014,5.19,394,"",{"$f":"VLOOKUP(EpisodeList[[#This Row],[Season Number]], INDIRECT(\"'\" & EpisodeList[[#This Row],[Show]] & \" Season Info'!C2:J15\"), 8,1)","v":"2011-12"}]
["30 Rock","Season 6",6,{"$f":"A396& \" S\" &C396","v":"30 Rock S6"},110,7,"\"The Tuxedo Begins\"","John Riggi","Dylan Morgan & Josh Siegal","2012-02-16",{"$f":"CHOOSE(WEEKDAY(J396),\"Sun\",\"Mon\",\"Tue\",\"Wed\",\"Thu\",\"Fri\",\"Sat\")","v":"Thu"},"20:00:00",607,3.59,395,"",{"$f":"VLOOKUP(EpisodeList[[#This Row],[Season Number]], INDIRECT(\"'\" & EpisodeList[[#This Row],[Show]] & \" Season Info'!C2:J15\"), 8,1)","v":"2011-12"}]
["30 Rock","Season 6",6,{"$f":"A397& \" S\" &C397","v":"30 Rock S6"},111,8,"\"The Tuxedo Begins\"","John Riggi","Dylan Morgan & Josh Siegal","2012-02-16",{"$f":"CHOOSE(WEEKDAY(J397),\"Sun\",\"Mon\",\"Tue\",\"Wed\",\"Thu\",\"Fri\",\"Sat\")","v":"Thu"},"20:00:00",608,3.59,396,"",{"$f":"VLOOKUP(EpisodeList[[#This Row],[Season Number]], INDIRECT(\"'\" & EpisodeList[[#This Row],[Show]] & \" Season Info'!C2:J15\"), 8,1)","v":"2011-12"}]
["The Office","Season 8",8,{"$f":"A398& \" S\" &C398","v":"The Office S8"},167,15,"\"Tallahassee\"","Matt Sohn","Daniel Chun","2012-02-16",{"$f":"CHOOSE(WEEKDAY(J398),\"Sun\",\"Mon\",\"Tue\",\"Wed\",\"Thu\",\"Fri\",\"Sat\")","v":"Thu"},"21:00:00",8015,4.38,397,"",{"$f":"VLOOKUP(EpisodeList[[#This Row],[Season Number]], INDIRECT(\"'\" & EpisodeList[[#This Row],[Show]] & \" Season Info'!C2:J15\"), 8,1)","v":"2011-12"}]
["Parks and Rec","Season 4",4,{"$f":"A399& \" S\" &C399","v":"Parks and Rec S4"},61,15,"\"Dave Returns\"","Robert B. Weide","Harris Wittels","2012-02-16",{"$f":"CHOOSE(WEEKDAY(J399),\"Sun\",\"Mon\",\"Tue\",\"Wed\",\"Thu\",\"Fri\",\"Sat\")","v":"Thu"},"21:30:00",null,3.45,398,"",{"$f":"VLOOKUP(EpisodeList[[#This Row],[Season Number]], INDIRECT(\"'\" & EpisodeList[[#This Row],[Show]] & \" Season Info'!C2:J15\"), 8,1)","v":"2011-12"}]
["30 Rock","Season 6",6,{"$f":"A400& \" S\" &C400","v":"30 Rock S6"},112,9,"\"Leap Day\"","Steve Buscemi","Luke Del Tredici","2012-02-23",{"$f":"CHOOSE(WEEKDAY(J400),\"Sun\",\"Mon\",\"Tue\",\"Wed\",\"Thu\",\"Fri\",\"Sat\")","v":"Thu"},"20:00:00",609,3.7,399,"",{"$f":"VLOOKUP(EpisodeList[[#This Row],[Season Number]], INDIRECT(\"'\" & EpisodeList[[#This Row],[Show]] & \" Season Info'!C2:J15\"), 8,1)","v":"2011-12"}]
["The Office","Season 8",8,{"$f":"A401& \" S\" &C401","v":"The Office S8"},168,16,"\"After Hours\"","Brian Baumgartner","Halsted Sullivan & Warren Lieberstein","2012-02-23",{"$f":"CHOOSE(WEEKDAY(J401),\"Sun\",\"Mon\",\"Tue\",\"Wed\",\"Thu\",\"Fri\",\"Sat\")","v":"Thu"},"21:00:00",8016,5.0199999999999996,400,"",{"$f":"VLOOKUP(EpisodeList[[#This Row],[Season Number]], INDIRECT(\"'\" & EpisodeList[[#This Row],[Show]] & \" Season Info'!C2:J15\"), 8,1)","v":"2011-12"}]
["Parks and Rec","Season 4",4,{"$f":"A402& \" S\" &C402","v":"Parks and Rec S4"},62,16,"\"Sweet Sixteen\"","Michael Schur","Norm Hiscock","2012-02-23",{"$f":"CHOOSE(WEEKDAY(J402),\"Sun\",\"Mon\",\"Tue\",\"Wed\",\"Thu\",\"Fri\",\"Sat\")","v":"Thu"},"21:30:00",null,3.43,401,"",{"$f":"VLOOKUP(EpisodeList[[#This Row],[Season Number]], INDIRECT(\"'\" & EpisodeList[[#This Row],[Show]] & \" Season Info'!C2:J15\"), 8,1)","v":"2011-12"}]
["30 Rock","Season 6",6,{"$f":"A403& \" S\" &C403","v":"30 Rock S6"},113,10,"\"Alexis Goodlooking and the Case of the Missing Whisky\"","Michael Slovis","John Riggi","2012-03-01",{"$f":"CHOOSE(WEEKDAY(J403),\"Sun\",\"Mon\",\"Tue\",\"Wed\",\"Thu\",\"Fri\",\"Sat\")","v":"Thu"},"20:00:00",610,3.77,402,"",{"$f":"VLOOKUP(EpisodeList[[#This Row],[Season Number]], INDIRECT(\"'\" & EpisodeList[[#This Row],[Show]] & \" Season Info'!C2:J15\"), 8,1)","v":"2011-12"}]
["The Office","Season 8",8,{"$f":"A404& \" S\" &C404","v":"The Office S8"},169,17,"\"Test the Store\"","Brent Forrester","Mindy Kaling","2012-03-01",{"$f":"CHOOSE(WEEKDAY(J404),\"Sun\",\"Mon\",\"Tue\",\"Wed\",\"Thu\",\"Fri\",\"Sat\")","v":"Thu"},"21:00:00",8017,4.95,403,"",{"$f":"VLOOKUP(EpisodeList[[#This Row],[Season Number]], INDIRECT(\"'\" & EpisodeList[[#This Row],[Show]] & \" Season Info'!C2:J15\"), 8,1)","v":"2011-12"}]
["Parks and Rec","Season 4",4,{"$f":"A405& \" S\" &C405","v":"Parks and Rec S4"},63,17,"\"Campaign Shake-Up\"","Dan Goor","Dan Goor","2012-03-01",{"$f":"CHOOSE(WEEKDAY(J405),\"Sun\",\"Mon\",\"Tue\",\"Wed\",\"Thu\",\"Fri\",\"Sat\")","v":"Thu"},"21:30:00",null,3.77,404,"",{"$f":"VLOOKUP(EpisodeList[[#This Row],[Season Number]], INDIRECT(\"'\" & EpisodeList[[#This Row],[Show]] & \" Season Info'!C2:J15\"), 8,1)","v":"2011-12"}]
["30 Rock","Season 6",6,{"$f":"A406& \" S\" &C406","v":"30 Rock S6"},114,11,"\"Standards and Practices\"","Beth McCarthy-Miller","Vali Chandrasekaran","2012-03-08",{"$f":"CHOOSE(WEEKDAY(J406),\"Sun\",\"Mon\",\"Tue\",\"Wed\",\"Thu\",\"Fri\",\"Sat\")","v":"Thu"},"20:00:00",611,3.42,405,"",{"$f":"VLOOKUP(EpisodeList[[#This Row],[Season Number]], INDIRECT(\"'\" & EpisodeList[[#This Row],[Show]] & \" Season Info'!C2:J15\"), 8,1)","v":"2011-12"}]
["The Office","Season 8",8,{"$f":"A407& \" S\" &C407","v":"The Office S8"},170,18,"\"Last Day in Florida\"","Matt Sohn","Robert Padnick","2012-03-08",{"$f":"CHOOSE(WEEKDAY(J407),\"Sun\",\"Mon\",\"Tue\",\"Wed\",\"Thu\",\"Fri\",\"Sat\")","v":"Thu"},"21:00:00",8018,4.8899999999999997,406,"",{"$f":"VLOOKUP(EpisodeList[[#This Row],[Season Number]], INDIRECT(\"'\" & EpisodeList[[#This Row],[Show]] & \" Season Info'!C2:J15\"), 8,1)","v":"2011-12"}]
["Parks and Rec","Season 4",4,{"$f":"A408& \" S\" &C408","v":"Parks and Rec S4"},64,18,"\"Lucky\"","Troy Miller","Nick Offerman","2012-03-08",{"$f":"CHOOSE(WEEKDAY(J408),\"Sun\",\"Mon\",\"Tue\",\"Wed\",\"Thu\",\"Fri\",\"Sat\")","v":"Thu"},"21:30:00",null,3.66,407,"",{"$f":"VLOOKUP(EpisodeList[[#This Row],[Season Number]], INDIRECT(\"'\" & EpisodeList[[#This Row],[Show]] & \" Season Info'!C2:J15\"), 8,1)","v":"2011-12"}]
["Community","Season 3",3,{"$f":"A409& \" S\" &C409","v":"Community S3"},60,11,"\"Urban Matrimony and the Sandwich Arts\"","Kyle Newacheck","Vera Santamaria","2012-03-15",{"$f":"CHOOSE(WEEKDAY(J409),\"Sun\",\"Mon\",\"Tue\",\"Wed\",\"Thu\",\"Fri\",\"Sat\")","v":"Thu"},"20:00:00",312,4.75,408,"",{"$f":"VLOOKUP(EpisodeList[[#This Row],[Season Number]], INDIRECT(\"'\" & EpisodeList[[#This Row],[Show]] & \" Season Info'!C2:J15\"), 8,1)","v":"2011-12"}]
["30 Rock","Season 6",6,{"$f":"A410& \" S\" &C410","v":"30 Rock S6"},115,12,"\"St. Patrick's Day\"","John Riggi","Colleen McGuinness","2012-03-15",{"$f":"CHOOSE(WEEKDAY(J410),\"Sun\",\"Mon\",\"Tue\",\"Wed\",\"Thu\",\"Fri\",\"Sat\")","v":"Thu"},"20:30:00",612,4,409,"",{"$f":"VLOOKUP(EpisodeList[[#This Row],[Season Number]], INDIRECT(\"'\" & EpisodeList[[#This Row],[Show]] & \" Season Info'!C2:J15\"), 8,1)","v":"2011-12"}]
["The Office","Season 8",8,{"$f":"A411& \" S\" &C411","v":"The Office S8"},171,19,"\"Get the Girl\"","Rainn Wilson","Charlie Grandy","2012-03-15",{"$f":"CHOOSE(WEEKDAY(J411),\"Sun\",\"Mon\",\"Tue\",\"Wed\",\"Thu\",\"Fri\",\"Sat\")","v":"Thu"},"21:00:00",8019,4.87,410,"",{"$f":"VLOOKUP(EpisodeList[[#This Row],[Season Number]], INDIRECT(\"'\" & EpisodeList[[#This Row],[Show]] & \" Season Info'!C2:J15\"), 8,1)","v":"2011-12"}]
["Community","Season 3",3,{"$f":"A412& \" S\" &C412","v":"Community S3"},61,12,"\"Contemporary Impressionists\"","Kyle Newacheck","Alex Cooley","2012-03-22",{"$f":"CHOOSE(WEEKDAY(J412),\"Sun\",\"Mon\",\"Tue\",\"Wed\",\"Thu\",\"Fri\",\"Sat\")","v":"Thu"},"20:00:00",310,3.87,411,"",{"$f":"VLOOKUP(EpisodeList[[#This Row],[Season Number]], INDIRECT(\"'\" & EpisodeList[[#This Row],[Show]] & \" Season Info'!C2:J15\"), 8,1)","v":"2011-12"}]
["30 Rock","Season 6",6,{"$f":"A413& \" S\" &C413","v":"30 Rock S6"},116,13,"\"Grandmentor\"","Beth McCarthy-Miller","Sam Means","2012-03-22",{"$f":"CHOOSE(WEEKDAY(J413),\"Sun\",\"Mon\",\"Tue\",\"Wed\",\"Thu\",\"Fri\",\"Sat\")","v":"Thu"},"20:30:00",613,3.31,412,"",{"$f":"VLOOKUP(EpisodeList[[#This Row],[Season Number]], INDIRECT(\"'\" & EpisodeList[[#This Row],[Show]] & \" Season Info'!C2:J15\"), 8,1)","v":"2011-12"}]
["30 Rock","Season 6",6,{"$f":"A414& \" S\" &C414","v":"30 Rock S6"},117,14,"\"Kidnapped by Danger\"","Claire Cowperthwaite","Tina Fey","2012-03-22",{"$f":"CHOOSE(WEEKDAY(J414),\"Sun\",\"Mon\",\"Tue\",\"Wed\",\"Thu\",\"Fri\",\"Sat\")","v":"Thu"},"20:30:00",614,3.42,413,"",{"$f":"VLOOKUP(EpisodeList[[#This Row],[Season Number]], INDIRECT(\"'\" & EpisodeList[[#This Row],[Show]] & \" Season Info'!C2:J15\"), 8,1)","v":"2011-12"}]
["Community","Season 3",3,{"$f":"A415& \" S\" &C415","v":"Community S3"},62,13,"\"Digital Exploration of Interior Design\"","Dan Eckman","Chris McKenna","2012-03-29",{"$f":"CHOOSE(WEEKDAY(J415),\"Sun\",\"Mon\",\"Tue\",\"Wed\",\"Thu\",\"Fri\",\"Sat\")","v":"Thu"},"20:00:00",313,3.48,414,"",{"$f":"VLOOKUP(EpisodeList[[#This Row],[Season Number]], INDIRECT(\"'\" & EpisodeList[[#This Row],[Show]] & \" Season Info'!C2:J15\"), 8,1)","v":"2011-12"}]
["30 Rock","Season 6",6,{"$f":"A416& \" S\" &C416","v":"30 Rock S6"},118,15,"\"The Shower Principle\"","Stephen Lee Davis","Tom Ceraulo","2012-03-29",{"$f":"CHOOSE(WEEKDAY(J416),\"Sun\",\"Mon\",\"Tue\",\"Wed\",\"Thu\",\"Fri\",\"Sat\")","v":"Thu"},"20:30:00",615,3.14,415,"",{"$f":"VLOOKUP(EpisodeList[[#This Row],[Season Number]], INDIRECT(\"'\" & EpisodeList[[#This Row],[Show]] & \" Season Info'!C2:J15\"), 8,1)","v":"2011-12"}]
["Community","Season 3",3,{"$f":"A417& \" S\" &C417","v":"Community S3"},63,14,"\"Pillows and Blankets\"","Tristram Shapeero","Andy Bobrow","2012-04-05",{"$f":"CHOOSE(WEEKDAY(J417),\"Sun\",\"Mon\",\"Tue\",\"Wed\",\"Thu\",\"Fri\",\"Sat\")","v":"Thu"},"20:00:00",314,3,416,"",{"$f":"VLOOKUP(EpisodeList[[#This Row],[Season Number]], INDIRECT(\"'\" & EpisodeList[[#This Row],[Show]] & \" Season Info'!C2:J15\"), 8,1)","v":"2011-12"}]
["30 Rock","Season 6",6,{"$f":"A418& \" S\" &C418","v":"30 Rock S6"},119,16,"\"Nothing Left to Lose\"","John Riggi","Lauren Gurganous & Nina Pedrad","2012-04-05",{"$f":"CHOOSE(WEEKDAY(J418),\"Sun\",\"Mon\",\"Tue\",\"Wed\",\"Thu\",\"Fri\",\"Sat\")","v":"Thu"},"20:30:00",616,2.79,417,"",{"$f":"VLOOKUP(EpisodeList[[#This Row],[Season Number]], INDIRECT(\"'\" & EpisodeList[[#This Row],[Show]] & \" Season Info'!C2:J15\"), 8,1)","v":"2011-12"}]
["Community","Season 3",3,{"$f":"A419& \" S\" &C419","v":"Community S3"},64,15,"\"Origins of Vampire Mythology\"","Steven Tsuchida","Dan Harmon","2012-04-12",{"$f":"CHOOSE(WEEKDAY(J419),\"Sun\",\"Mon\",\"Tue\",\"Wed\",\"Thu\",\"Fri\",\"Sat\")","v":"Thu"},"20:00:00",315,3.09,418,"",{"$f":"VLOOKUP(EpisodeList[[#This Row],[Season Number]], INDIRECT(\"'\" & EpisodeList[[#This Row],[Show]] & \" Season Info'!C2:J15\"), 8,1)","v":"2011-12"}]
["30 Rock","Season 6",6,{"$f":"A420& \" S\" &C420","v":"30 Rock S6"},120,17,"\"Meet the Woggels!\"","Linda Mendoza","Ron Weiner","2012-04-12",{"$f":"CHOOSE(WEEKDAY(J420),\"Sun\",\"Mon\",\"Tue\",\"Wed\",\"Thu\",\"Fri\",\"Sat\")","v":"Thu"},"20:30:00",617,2.98,419,"",{"$f":"VLOOKUP(EpisodeList[[#This Row],[Season Number]], INDIRECT(\"'\" & EpisodeList[[#This Row],[Show]] & \" Season Info'!C2:J15\"), 8,1)","v":"2011-12"}]
["The Office","Season 8",8,{"$f":"A421& \" S\" &C421","v":"The Office S8"},172,20,"\"Welcome Party\"","Ed Helms","Steve Hely","2012-04-12",{"$f":"CHOOSE(WEEKDAY(J421),\"Sun\",\"Mon\",\"Tue\",\"Wed\",\"Thu\",\"Fri\",\"Sat\")","v":"Thu"},"21:00:00",8020,4.3899999999999997,420,"",{"$f":"VLOOKUP(EpisodeList[[#This Row],[Season Number]], INDIRECT(\"'\" & EpisodeList[[#This Row],[Show]] & \" Season Info'!C2:J15\"), 8,1)","v":"2011-12"}]
["Community","Season 3",3,{"$f":"A422& \" S\" &C422","v":"Community S3"},65,16,"\"Virtual Systems Analysis\"","Tristram Shapeero","Matt Murray","2012-04-19",{"$f":"CHOOSE(WEEKDAY(J422),\"Sun\",\"Mon\",\"Tue\",\"Wed\",\"Thu\",\"Fri\",\"Sat\")","v":"Thu"},"20:00:00",316,2.77,421,"Yes",{"$f":"VLOOKUP(EpisodeList[[#This Row],[Season Number]], INDIRECT(\"'\" & EpisodeList[[#This Row],[Show]] & \" Season Info'!C2:J15\"), 8,1)","v":"2011-12"}]
["30 Rock","Season 6",6,{"$f":"A423& \" S\" &C423","v":"30 Rock S6"},121,18,"\"Murphy Brown Lied to Us\"","John Riggi","Robert Carlock & Vali Chandrasekaran","2012-04-19",{"$f":"CHOOSE(WEEKDAY(J423),\"Sun\",\"Mon\",\"Tue\",\"Wed\",\"Thu\",\"Fri\",\"Sat\")","v":"Thu"},"20:30:00",618,3.06,422,"Yes",{"$f":"VLOOKUP(EpisodeList[[#This Row],[Season Number]], INDIRECT(\"'\" & EpisodeList[[#This Row],[Show]] & \" Season Info'!C2:J15\"), 8,1)","v":"2011-12"}]
["The Office","Season 8",8,{"$f":"A424& \" S\" &C424","v":"The Office S8"},173,21,"\"Angry Andy\"","Claire Scanlon","Justin Spitzer","2012-04-19",{"$f":"CHOOSE(WEEKDAY(J424),\"Sun\",\"Mon\",\"Tue\",\"Wed\",\"Thu\",\"Fri\",\"Sat\")","v":"Thu"},"21:00:00",8021,4.3499999999999996,423,"Yes",{"$f":"VLOOKUP(EpisodeList[[#This Row],[Season Number]], INDIRECT(\"'\" & EpisodeList[[#This Row],[Show]] & \" Season Info'!C2:J15\"), 8,1)","v":"2011-12"}]
["Parks and Rec","Season 4",4,{"$f":"A425& \" S\" &C425","v":"Parks and Rec S4"},65,19,"\"Live Ammo\"","Tristram Shapeero","Dave King & Chelsea Peretti","2012-04-19",{"$f":"CHOOSE(WEEKDAY(J425),\"Sun\",\"Mon\",\"Tue\",\"Wed\",\"Thu\",\"Fri\",\"Sat\")","v":"Thu"},"21:30:00",null,3.46,424,"Yes",{"$f":"VLOOKUP(EpisodeList[[#This Row],[Season Number]], INDIRECT(\"'\" & EpisodeList[[#This Row],[Show]] & \" Season Info'!C2:J15\"), 8,1)","v":"2011-12"}]
["Community","Season 3",3,{"$f":"A426& \" S\" &C426","v":"Community S3"},66,17,"\"Basic Lupine Urology\"","Rob Schrab","Megan Ganz","2012-04-26",{"$f":"CHOOSE(WEEKDAY(J426),\"Sun\",\"Mon\",\"Tue\",\"Wed\",\"Thu\",\"Fri\",\"Sat\")","v":"Thu"},"20:00:00",317,3.21,425,"Yes",{"$f":"VLOOKUP(EpisodeList[[#This Row],[Season Number]], INDIRECT(\"'\" & EpisodeList[[#This Row],[Show]] & \" Season Info'!C2:J15\"), 8,1)","v":"2011-12"}]
["30 Rock","Season 6",6,{"$f":"A427& \" S\" &C427","v":"30 Rock S6"},122,19,"\"Live from Studio 6H\"","Beth McCarthy Miller","Jack Burditt & Tina Fey","2012-04-26",{"$f":"CHOOSE(WEEKDAY(J427),\"Sun\",\"Mon\",\"Tue\",\"Wed\",\"Thu\",\"Fri\",\"Sat\")","v":"Thu"},"20:30:00",619,3.47,426,"Yes",{"$f":"VLOOKUP(EpisodeList[[#This Row],[Season Number]], INDIRECT(\"'\" & EpisodeList[[#This Row],[Show]] & \" Season Info'!C2:J15\"), 8,1)","v":"2011-12"}]
["The Office","Season 8",8,{"$f":"A428& \" S\" &C428","v":"The Office S8"},174,22,"\"Fundraiser\"","David Rogers","Owen Ellickson","2012-04-26",{"$f":"CHOOSE(WEEKDAY(J428),\"Sun\",\"Mon\",\"Tue\",\"Wed\",\"Thu\",\"Fri\",\"Sat\")","v":"Thu"},"21:00:00",8022,4.17,427,"Yes",{"$f":"VLOOKUP(EpisodeList[[#This Row],[Season Number]], INDIRECT(\"'\" & EpisodeList[[#This Row],[Show]] & \" Season Info'!C2:J15\"), 8,1)","v":"2011-12"}]
["Parks and Rec","Season 4",4,{"$f":"A429& \" S\" &C429","v":"Parks and Rec S4"},66,20,"\"The Debate\"","Amy Poehler","Amy Poehler","2012-04-26",{"$f":"CHOOSE(WEEKDAY(J429),\"Sun\",\"Mon\",\"Tue\",\"Wed\",\"Thu\",\"Fri\",\"Sat\")","v":"Thu"},"21:30:00",null,3.17,428,"Yes",{"$f":"VLOOKUP(EpisodeList[[#This Row],[Season Number]], INDIRECT(\"'\" & EpisodeList[[#This Row],[Show]] & \" Season Info'!C2:J15\"), 8,1)","v":"2011-12"}]
["Community","Season 3",3,{"$f":"A430& \" S\" &C430","v":"Community S3"},67,18,"\"Course Listing Unavailable\"","Tristram Shapeero","Tim Saccardo","2012-05-03",{"$f":"CHOOSE(WEEKDAY(J430),\"Sun\",\"Mon\",\"Tue\",\"Wed\",\"Thu\",\"Fri\",\"Sat\")","v":"Thu"},"20:00:00",318,3.2,429,"Yes",{"$f":"VLOOKUP(EpisodeList[[#This Row],[Season Number]], INDIRECT(\"'\" & EpisodeList[[#This Row],[Show]] & \" Season Info'!C2:J15\"), 8,1)","v":"2011-12"}]
["30 Rock","Season 6",6,{"$f":"A431& \" S\" &C431","v":"30 Rock S6"},123,20,"\"Queen of Jordan 2: Mystery of the Phantom Pooper\"","Ken Whittingham","Luke Del Tredici & Tracey Wigfield","2012-05-03",{"$f":"CHOOSE(WEEKDAY(J431),\"Sun\",\"Mon\",\"Tue\",\"Wed\",\"Thu\",\"Fri\",\"Sat\")","v":"Thu"},"20:30:00",620,3.04,430,"Yes",{"$f":"VLOOKUP(EpisodeList[[#This Row],[Season Number]], INDIRECT(\"'\" & EpisodeList[[#This Row],[Show]] & \" Season Info'!C2:J15\"), 8,1)","v":"2011-12"}]
["The Office","Season 8",8,{"$f":"A432& \" S\" &C432","v":"The Office S8"},175,23,"\"Turf War\"","Daniel Chun","Warren Lieberstein & Halsted Sullivan","2012-05-03",{"$f":"CHOOSE(WEEKDAY(J432),\"Sun\",\"Mon\",\"Tue\",\"Wed\",\"Thu\",\"Fri\",\"Sat\")","v":"Thu"},"21:00:00",8023,4.4400000000000004,431,"Yes",{"$f":"VLOOKUP(EpisodeList[[#This Row],[Season Number]], INDIRECT(\"'\" & EpisodeList[[#This Row],[Show]] & \" Season Info'!C2:J15\"), 8,1)","v":"2011-12"}]
["Parks and Rec","Season 4",4,{"$f":"A433& \" S\" &C433","v":"Parks and Rec S4"},67,21,"\"Bus Tour\"","Dean Holland","Aisha Muharrar & Alan Yang","2012-05-03",{"$f":"CHOOSE(WEEKDAY(J433),\"Sun\",\"Mon\",\"Tue\",\"Wed\",\"Thu\",\"Fri\",\"Sat\")","v":"Thu"},"21:30:00",null,3.26,432,"Yes",{"$f":"VLOOKUP(EpisodeList[[#This Row],[Season Number]], INDIRECT(\"'\" & EpisodeList[[#This Row],[Show]] & \" Season Info'!C2:J15\"), 8,1)","v":"2011-12"}]
["Community","Season 3",3,{"$f":"A434& \" S\" &C434","v":"Community S3"},68,19,"\"Curriculum Unavailable\"","Adam Davidson","Adam Countee","2012-05-10",{"$f":"CHOOSE(WEEKDAY(J434),\"Sun\",\"Mon\",\"Tue\",\"Wed\",\"Thu\",\"Fri\",\"Sat\")","v":"Thu"},"20:00:00",319,2.99,433,"Yes",{"$f":"VLOOKUP(EpisodeList[[#This Row],[Season Number]], INDIRECT(\"'\" & EpisodeList[[#This Row],[Show]] & \" Season Info'!C2:J15\"), 8,1)","v":"2011-12"}]
["30 Rock","Season 6",6,{"$f":"A435& \" S\" &C435","v":"30 Rock S6"},124,21,"\"The Return of Avery Jessup\"","John Riggi","Dylan Morgan & Josh Siegal","2012-05-10",{"$f":"CHOOSE(WEEKDAY(J435),\"Sun\",\"Mon\",\"Tue\",\"Wed\",\"Thu\",\"Fri\",\"Sat\")","v":"Thu"},"20:30:00",621,2.92,434,"Yes",{"$f":"VLOOKUP(EpisodeList[[#This Row],[Season Number]], INDIRECT(\"'\" & EpisodeList[[#This Row],[Show]] & \" Season Info'!C2:J15\"), 8,1)","v":"2011-12"}]
["The Office","Season 8",8,{"$f":"A436& \" S\" &C436","v":"The Office S8"},176,24,"\"Free Family Portrait Studio\"","B. J. Novak","B. J. Novak","2012-05-10",{"$f":"CHOOSE(WEEKDAY(J436),\"Sun\",\"Mon\",\"Tue\",\"Wed\",\"Thu\",\"Fri\",\"Sat\")","v":"Thu"},"21:00:00",8024,4.49,435,"Yes",{"$f":"VLOOKUP(EpisodeList[[#This Row],[Season Number]], INDIRECT(\"'\" & EpisodeList[[#This Row],[Show]] & \" Season Info'!C2:J15\"), 8,1)","v":"2011-12"}]
["Parks and Rec","Season 4",4,{"$f":"A437& \" S\" &C437","v":"Parks and Rec S4"},68,22,"\"Win, Lose, or Draw\"","Michael Schur","Michael Schur","2012-05-10",{"$f":"CHOOSE(WEEKDAY(J437),\"Sun\",\"Mon\",\"Tue\",\"Wed\",\"Thu\",\"Fri\",\"Sat\")","v":"Thu"},"21:30:00",null,3.42,436,"Yes",{"$f":"VLOOKUP(EpisodeList[[#This Row],[Season Number]], INDIRECT(\"'\" & EpisodeList[[#This Row],[Show]] & \" Season Info'!C2:J15\"), 8,1)","v":"2011-12"}]
["Community","Season 3",3,{"$f":"A438& \" S\" &C438","v":"Community S3"},69,20,"\"Digital Estate Planning\"","Adam Davidson","Matt Warburton","2012-05-17",{"$f":"CHOOSE(WEEKDAY(J438),\"Sun\",\"Mon\",\"Tue\",\"Wed\",\"Thu\",\"Fri\",\"Sat\")","v":"Thu"},"20:00:00",322,2.97,437,"",{"$f":"VLOOKUP(EpisodeList[[#This Row],[Season Number]], INDIRECT(\"'\" & EpisodeList[[#This Row],[Show]] & \" Season Info'!C2:J15\"), 8,1)","v":"2011-12"}]
["30 Rock","Season 6",6,{"$f":"A439& \" S\" &C439","v":"30 Rock S6"},125,22,"\"What Will Happen to the Gang Next Year?\"","Michael Engler","Matt Hubbard","2012-05-17",{"$f":"CHOOSE(WEEKDAY(J439),\"Sun\",\"Mon\",\"Tue\",\"Wed\",\"Thu\",\"Fri\",\"Sat\")","v":"Thu"},"20:30:00",622,2.84,438,"",{"$f":"VLOOKUP(EpisodeList[[#This Row],[Season Number]], INDIRECT(\"'\" & EpisodeList[[#This Row],[Show]] & \" Season Info'!C2:J15\"), 8,1)","v":"2011-12"}]
["Community","Season 3",3,{"$f":"A440& \" S\" &C440","v":"Community S3"},70,21,"\"The First Chang Dynasty\"","Jay Chandrasekhar","Matt Fusfeld & Alex Cuthbertson","2012-05-17",{"$f":"CHOOSE(WEEKDAY(J440),\"Sun\",\"Mon\",\"Tue\",\"Wed\",\"Thu\",\"Fri\",\"Sat\")","v":"Thu"},"21:00:00",320,2.61,439,"",{"$f":"VLOOKUP(EpisodeList[[#This Row],[Season Number]], INDIRECT(\"'\" & EpisodeList[[#This Row],[Show]] & \" Season Info'!C2:J15\"), 8,1)","v":"2011-12"}]
["Community","Season 3",3,{"$f":"A441& \" S\" &C441","v":"Community S3"},71,22,"\"Introduction to Finality\"","Tristram Shapeero","Steve Basilone & Annie Mebane","2012-05-17",{"$f":"CHOOSE(WEEKDAY(J441),\"Sun\",\"Mon\",\"Tue\",\"Wed\",\"Thu\",\"Fri\",\"Sat\")","v":"Thu"},"21:30:00",321,2.48,440,"",{"$f":"VLOOKUP(EpisodeList[[#This Row],[Season Number]], INDIRECT(\"'\" & EpisodeList[[#This Row],[Show]] & \" Season Info'!C2:J15\"), 8,1)","v":"2011-12"}]
["The Office","Season 9",9,{"$f":"A442& \" S\" &C442","v":"The Office S9"},177,1,"\"New Guys\"","Greg Daniels","Greg Daniels","2012-09-20",{"$f":"CHOOSE(WEEKDAY(J442),\"Sun\",\"Mon\",\"Tue\",\"Wed\",\"Thu\",\"Fri\",\"Sat\")","v":"Thu"},"21:00:00",9001,4.28,441,"",{"$f":"VLOOKUP(EpisodeList[[#This Row],[Season Number]], INDIRECT(\"'\" & EpisodeList[[#This Row],[Show]] & \" Season Info'!C2:J15\"), 8,1)","v":"2012-13"}]
["Parks and Rec","Season 5",5,{"$f":"A443& \" S\" &C443","v":"Parks and Rec S5"},69,1,"\"Ms. Knope Goes to Washington\"","Dean Holland","Aisha Muharrar","2012-09-20",{"$f":"CHOOSE(WEEKDAY(J443),\"Sun\",\"Mon\",\"Tue\",\"Wed\",\"Thu\",\"Fri\",\"Sat\")","v":"Thu"},"21:30:00",null,3.5,442,"",{"$f":"VLOOKUP(EpisodeList[[#This Row],[Season Number]], INDIRECT(\"'\" & EpisodeList[[#This Row],[Show]] & \" Season Info'!C2:J15\"), 8,1)","v":"2012-13"}]
["The Office","Season 9",9,{"$f":"A444& \" S\" &C444","v":"The Office S9"},178,2,"\"Roy's Wedding\"","Matt Sohn","Allison Silverman","2012-09-27",{"$f":"CHOOSE(WEEKDAY(J444),\"Sun\",\"Mon\",\"Tue\",\"Wed\",\"Thu\",\"Fri\",\"Sat\")","v":"Thu"},"21:00:00",9002,4.13,443,"",{"$f":"VLOOKUP(EpisodeList[[#This Row],[Season Number]], INDIRECT(\"'\" & EpisodeList[[#This Row],[Show]] & \" Season Info'!C2:J15\"), 8,1)","v":"2012-13"}]
["Parks and Rec","Season 5",5,{"$f":"A445& \" S\" &C445","v":"Parks and Rec S5"},70,2,"\"Soda Tax\"","Kyle Newacheck","Norm Hiscock","2012-09-27",{"$f":"CHOOSE(WEEKDAY(J445),\"Sun\",\"Mon\",\"Tue\",\"Wed\",\"Thu\",\"Fri\",\"Sat\")","v":"Thu"},"21:30:00",null,3.27,444,"",{"$f":"VLOOKUP(EpisodeList[[#This Row],[Season Number]], INDIRECT(\"'\" & EpisodeList[[#This Row],[Show]] & \" Season Info'!C2:J15\"), 8,1)","v":"2012-13"}]
["30 Rock","Season 7",7,{"$f":"A446& \" S\" &C446","v":"30 Rock S7"},126,1,"\"The Beginning of the End\"","Don Scardino","Jack Burditt","2012-10-04",{"$f":"CHOOSE(WEEKDAY(J446),\"Sun\",\"Mon\",\"Tue\",\"Wed\",\"Thu\",\"Fri\",\"Sat\")","v":"Thu"},"20:00:00",701,3.46,445,"",{"$f":"VLOOKUP(EpisodeList[[#This Row],[Season Number]], INDIRECT(\"'\" & EpisodeList[[#This Row],[Show]] & \" Season Info'!C2:J15\"), 8,1)","v":"2012-13"}]
["The Office","Season 9",9,{"$f":"A447& \" S\" &C447","v":"The Office S9"},179,3,"\"Andy's Ancestry\"","David Rogers","Jonathan Green & Gabe Miller","2012-10-04",{"$f":"CHOOSE(WEEKDAY(J447),\"Sun\",\"Mon\",\"Tue\",\"Wed\",\"Thu\",\"Fri\",\"Sat\")","v":"Thu"},"21:00:00",9003,4.1399999999999997,446,"",{"$f":"VLOOKUP(EpisodeList[[#This Row],[Season Number]], INDIRECT(\"'\" & EpisodeList[[#This Row],[Show]] & \" Season Info'!C2:J15\"), 8,1)","v":"2012-13"}]
["Parks and Rec","Season 5",5,{"$f":"A448& \" S\" &C448","v":"Parks and Rec S5"},71,3,"\"How a Bill Becomes a Law\"","Ken Whittingham","Dan Goor","2012-10-04",{"$f":"CHOOSE(WEEKDAY(J448),\"Sun\",\"Mon\",\"Tue\",\"Wed\",\"Thu\",\"Fri\",\"Sat\")","v":"Thu"},"21:30:00",null,3.53,447,"",{"$f":"VLOOKUP(EpisodeList[[#This Row],[Season Number]], INDIRECT(\"'\" & EpisodeList[[#This Row],[Show]] & \" Season Info'!C2:J15\"), 8,1)","v":"2012-13"}]
["30 Rock","Season 7",7,{"$f":"A449& \" S\" &C449","v":"30 Rock S7"},127,2,"\"Governor Dunston\"","Robert Carlock","Robert Carlock","2012-10-11",{"$f":"CHOOSE(WEEKDAY(J449),\"Sun\",\"Mon\",\"Tue\",\"Wed\",\"Thu\",\"Fri\",\"Sat\")","v":"Thu"},"20:00:00",702,3.4,448,"",{"$f":"VLOOKUP(EpisodeList[[#This Row],[Season Number]], INDIRECT(\"'\" & EpisodeList[[#This Row],[Show]] & \" Season Info'!C2:J15\"), 8,1)","v":"2012-13"}]
["30 Rock","Season 7",7,{"$f":"A450& \" S\" &C450","v":"30 Rock S7"},128,3,"\"Stride of Pride\"","Michael Engler","Tina Fey","2012-10-18",{"$f":"CHOOSE(WEEKDAY(J450),\"Sun\",\"Mon\",\"Tue\",\"Wed\",\"Thu\",\"Fri\",\"Sat\")","v":"Thu"},"20:00:00",703,3.04,449,{"$f":"IF(AND(\n    COUNTIFS(A:A, A450, J:J, J450) = 1,\n    COUNTIFS(A:A, \"30 Rock\", J:J, J450) = 1,\n    COUNTIFS(A:A, \"The Office\", J:J, J450) = 1,\n    COUNTIFS(A:A, \"Community\", J:J, J450) = 1,\n    COUNTIFS(A:A, \"Parks and Rec\", J:J, J450) = 1\n), \"Yes\", \"\")","v":""},{"$f":"VLOOKUP(EpisodeList[[#This Row],[Season Number]], INDIRECT(\"'\" & EpisodeList[[#This Row],[Show]] & \" Season Info'!C2:J15\"), 8,1)","v":"2012-13"}]
["The Office","Season 9",9,{"$f":"A451& \" S\" &C451","v":"The Office S9"},180,4,"\"Work Bus\"","Bryan Cranston","Brent Forrester","2012-10-18",{"$f":"CHOOSE(WEEKDAY(J451),\"Sun\",\"Mon\",\"Tue\",\"Wed\",\"Thu\",\"Fri\",\"Sat\")","v":"Thu"},"21:00:00",9004,4.28,450,"",{"$f":"VLOOKUP(EpisodeList[[#This Row],[Season Number]], INDIRECT(\"'\" & EpisodeList[[#This Row],[Show]] & \" Season Info'!C2:J15\"), 8,1)","v":"2012-13"}]
["Parks and Rec","Season 5",5,{"$f":"A452& \" S\" &C452","v":"Parks and Rec S5"},72,4,"\"Sex Education\"","Craig Zisk","Alan Yang","2012-10-18",{"$f":"CHOOSE(WEEKDAY(J452),\"Sun\",\"Mon\",\"Tue\",\"Wed\",\"Thu\",\"Fri\",\"Sat\")","v":"Thu"},"21:30:00",null,3.46,451,"",{"$f":"VLOOKUP(EpisodeList[[#This Row],[Season Number]], INDIRECT(\"'\" & EpisodeList[[#This Row],[Show]] & \" Season Info'!C2:J15\"), 8,1)","v":"2012-13"}]
["30 Rock","Season 7",7,{"$f":"A453& \" S\" &C453","v":"30 Rock S7"},129,4,"\"Unwindulax\"","James E. Sheridan","Matt Hubbard","2012-10-25",{"$f":"CHOOSE(WEEKDAY(J453),\"Sun\",\"Mon\",\"Tue\",\"Wed\",\"Thu\",\"Fri\",\"Sat\")","v":"Thu"},"20:00:00",704,3.13,452,"",{"$f":"VLOOKUP(EpisodeList[[#This Row],[Season Number]], INDIRECT(\"'\" & EpisodeList[[#This Row],[Show]] & \" Season Info'!C2:J15\"), 8,1)","v":"2012-13"}]
["The Office","Season 9",9,{"$f":"A454& \" S\" &C454","v":"The Office S9"},181,5,"\"Here Comes Treble\"","Claire Scanlon","Owen Ellickson","2012-10-25",{"$f":"CHOOSE(WEEKDAY(J454),\"Sun\",\"Mon\",\"Tue\",\"Wed\",\"Thu\",\"Fri\",\"Sat\")","v":"Thu"},"21:00:00",9006,4,453,"",{"$f":"VLOOKUP(EpisodeList[[#This Row],[Season Number]], INDIRECT(\"'\" & EpisodeList[[#This Row],[Show]] & \" Season Info'!C2:J15\"), 8,1)","v":"2012-13"}]
["Parks and Rec","Season 5",5,{"$f":"A455& \" S\" &C455","v":"Parks and Rec S5"},73,5,"\"Halloween Surprise\"","Dean Holland","Michael Schur","2012-10-25",{"$f":"CHOOSE(WEEKDAY(J455),\"Sun\",\"Mon\",\"Tue\",\"Wed\",\"Thu\",\"Fri\",\"Sat\")","v":"Thu"},"21:30:00",null,3.34,454,"",{"$f":"VLOOKUP(EpisodeList[[#This Row],[Season Number]], INDIRECT(\"'\" & EpisodeList[[#This Row],[Show]] & \" Season Info'!C2:J15\"), 8,1)","v":"2012-13"}]
["30 Rock","Season 7",7,{"$f":"A456& \" S\" &C456","v":"30 Rock S7"},130,5,"\"There's No I in America\"","John Riggi","Josh Siegal & Dylan Morgan","2012-10-31",{"$f":"CHOOSE(WEEKDAY(J456),\"Sun\",\"Mon\",\"Tue\",\"Wed\",\"Thu\",\"Fri\",\"Sat\")","v":"Wed"},"20:00:00",705,3.38,455,"",{"$f":"VLOOKUP(EpisodeList[[#This Row],[Season Number]], INDIRECT(\"'\" & EpisodeList[[#This Row],[Show]] & \" Season Info'!C2:J15\"), 8,1)","v":"2012-13"}]
["The Office","Season 9",9,{"$f":"A457& \" S\" &C457","v":"The Office S9"},182,6,"\"The Boat\"","John Krasinski","Dan Sterling","2012-11-08",{"$f":"CHOOSE(WEEKDAY(J457),\"Sun\",\"Mon\",\"Tue\",\"Wed\",\"Thu\",\"Fri\",\"Sat\")","v":"Thu"},"21:00:00",9007,4.83,456,"",{"$f":"VLOOKUP(EpisodeList[[#This Row],[Season Number]], INDIRECT(\"'\" & EpisodeList[[#This Row],[Show]] & \" Season Info'!C2:J15\"), 8,1)","v":"2012-13"}]
["Parks and Rec","Season 5",5,{"$f":"A458& \" S\" &C458","v":"Parks and Rec S5"},74,6,"\"Ben's Parents\"","Dean Holland","Greg Levine","2012-11-08",{"$f":"CHOOSE(WEEKDAY(J458),\"Sun\",\"Mon\",\"Tue\",\"Wed\",\"Thu\",\"Fri\",\"Sat\")","v":"Thu"},"21:30:00",null,3.46,457,"",{"$f":"VLOOKUP(EpisodeList[[#This Row],[Season Number]], INDIRECT(\"'\" & EpisodeList[[#This Row],[Show]] & \" Season Info'!C2:J15\"), 8,1)","v":"2012-13"}]
["30 Rock","Season 7",7,{"$f":"A459& \" S\" &C459","v":"30 Rock S7"},131,6,"\"Aunt Phatso vs. Jack Donaghy\"","Don Scardino","Luke Del Tredici","2012-11-15",{"$f":"CHOOSE(WEEKDAY(J459),\"Sun\",\"Mon\",\"Tue\",\"Wed\",\"Thu\",\"Fri\",\"Sat\")","v":"Thu"},"20:00:00",706,3.34,458,"",{"$f":"VLOOKUP(EpisodeList[[#This Row],[Season Number]], INDIRECT(\"'\" & EpisodeList[[#This Row],[Show]] & \" Season Info'!C2:J15\"), 8,1)","v":"2012-13"}]
["The Office","Season 9",9,{"$f":"A460& \" S\" &C460","v":"The Office S9"},183,7,"\"The Whale\"","Rodman Flender","Carrie Kemper","2012-11-15",{"$f":"CHOOSE(WEEKDAY(J460),\"Sun\",\"Mon\",\"Tue\",\"Wed\",\"Thu\",\"Fri\",\"Sat\")","v":"Thu"},"21:00:00",9008,4.16,459,"",{"$f":"VLOOKUP(EpisodeList[[#This Row],[Season Number]], INDIRECT(\"'\" & EpisodeList[[#This Row],[Show]] & \" Season Info'!C2:J15\"), 8,1)","v":"2012-13"}]
["Parks and Rec","Season 5",5,{"$f":"A461& \" S\" &C461","v":"Parks and Rec S5"},75,7,"\"Leslie vs. April\"","Wendey Stanzler","Harris Wittels","2012-11-15",{"$f":"CHOOSE(WEEKDAY(J461),\"Sun\",\"Mon\",\"Tue\",\"Wed\",\"Thu\",\"Fri\",\"Sat\")","v":"Thu"},"21:30:00",null,3.52,460,"",{"$f":"VLOOKUP(EpisodeList[[#This Row],[Season Number]], INDIRECT(\"'\" & EpisodeList[[#This Row],[Show]] & \" Season Info'!C2:J15\"), 8,1)","v":"2012-13"}]
["30 Rock","Season 7",7,{"$f":"A462& \" S\" &C462","v":"30 Rock S7"},132,7,"\"Mazel Tov, Dummies!\"","Beth McCarthy-Miller","Tracey Wigfield","2012-11-29",{"$f":"CHOOSE(WEEKDAY(J462),\"Sun\",\"Mon\",\"Tue\",\"Wed\",\"Thu\",\"Fri\",\"Sat\")","v":"Thu"},"20:00:00",707,3.61,461,"",{"$f":"VLOOKUP(EpisodeList[[#This Row],[Season Number]], INDIRECT(\"'\" & EpisodeList[[#This Row],[Show]] & \" Season Info'!C2:J15\"), 8,1)","v":"2012-13"}]
["The Office","Season 9",9,{"$f":"A463& \" S\" &C463","v":"The Office S9"},184,8,"\"The Target\"","Brent Forrester","Graham Wagner","2012-11-29",{"$f":"CHOOSE(WEEKDAY(J463),\"Sun\",\"Mon\",\"Tue\",\"Wed\",\"Thu\",\"Fri\",\"Sat\")","v":"Thu"},"21:00:00",9009,3.88,462,"",{"$f":"VLOOKUP(EpisodeList[[#This Row],[Season Number]], INDIRECT(\"'\" & EpisodeList[[#This Row],[Show]] & \" Season Info'!C2:J15\"), 8,1)","v":"2012-13"}]
["Parks and Rec","Season 5",5,{"$f":"A464& \" S\" &C464","v":"Parks and Rec S5"},76,8,"\"Pawnee Commons\"","Morgan Sackett","Alexandra Rushfield","2012-11-29",{"$f":"CHOOSE(WEEKDAY(J464),\"Sun\",\"Mon\",\"Tue\",\"Wed\",\"Thu\",\"Fri\",\"Sat\")","v":"Thu"},"21:30:00",null,2.99,463,"",{"$f":"VLOOKUP(EpisodeList[[#This Row],[Season Number]], INDIRECT(\"'\" & EpisodeList[[#This Row],[Show]] & \" Season Info'!C2:J15\"), 8,1)","v":"2012-13"}]
["30 Rock","Season 7",7,{"$f":"A465& \" S\" &C465","v":"30 Rock S7"},133,8,"\"My Whole Life Is Thunder\"","Linda Mendoza","Jack Burditt & Colleen McGuinness","2012-12-06",{"$f":"CHOOSE(WEEKDAY(J465),\"Sun\",\"Mon\",\"Tue\",\"Wed\",\"Thu\",\"Fri\",\"Sat\")","v":"Thu"},"20:00:00",708,3.22,464,"",{"$f":"VLOOKUP(EpisodeList[[#This Row],[Season Number]], INDIRECT(\"'\" & EpisodeList[[#This Row],[Show]] & \" Season Info'!C2:J15\"), 8,1)","v":"2012-13"}]
["The Office","Season 9",9,{"$f":"A466& \" S\" &C466","v":"The Office S9"},185,9,"\"Dwight Christmas\"","Charles McDougall","Robert Padnick","2012-12-06",{"$f":"CHOOSE(WEEKDAY(J466),\"Sun\",\"Mon\",\"Tue\",\"Wed\",\"Thu\",\"Fri\",\"Sat\")","v":"Thu"},"21:00:00",9010,4.16,465,"",{"$f":"VLOOKUP(EpisodeList[[#This Row],[Season Number]], INDIRECT(\"'\" & EpisodeList[[#This Row],[Show]] & \" Season Info'!C2:J15\"), 8,1)","v":"2012-13"}]
["Parks and Rec","Season 5",5,{"$f":"A467& \" S\" &C467","v":"Parks and Rec S5"},77,9,"\"Ron and Diane\"","Dan Goor","Megan Amram & Aisha Muharrar","2012-12-06",{"$f":"CHOOSE(WEEKDAY(J467),\"Sun\",\"Mon\",\"Tue\",\"Wed\",\"Thu\",\"Fri\",\"Sat\")","v":"Thu"},"21:30:00",null,3.27,466,"",{"$f":"VLOOKUP(EpisodeList[[#This Row],[Season Number]], INDIRECT(\"'\" & EpisodeList[[#This Row],[Show]] & \" Season Info'!C2:J15\"), 8,1)","v":"2012-13"}]
["30 Rock","Season 7",7,{"$f":"A468& \" S\" &C468","v":"30 Rock S7"},134,9,"\"Game Over\"","Ken Whittingham","Robert Carlock & Sam Means","2013-01-10",{"$f":"CHOOSE(WEEKDAY(J468),\"Sun\",\"Mon\",\"Tue\",\"Wed\",\"Thu\",\"Fri\",\"Sat\")","v":"Thu"},"20:00:00",709,3.79,467,"",{"$f":"VLOOKUP(EpisodeList[[#This Row],[Season Number]], INDIRECT(\"'\" & EpisodeList[[#This Row],[Show]] & \" Season Info'!C2:J15\"), 8,1)","v":"2012-13"}]
["The Office","Season 9",9,{"$f":"A469& \" S\" &C469","v":"The Office S9"},186,10,"\"Lice\"","Rodman Flender","Niki Schwartz-Wright","2013-01-10",{"$f":"CHOOSE(WEEKDAY(J469),\"Sun\",\"Mon\",\"Tue\",\"Wed\",\"Thu\",\"Fri\",\"Sat\")","v":"Thu"},"21:00:00",9011,4.54,468,"",{"$f":"VLOOKUP(EpisodeList[[#This Row],[Season Number]], INDIRECT(\"'\" & EpisodeList[[#This Row],[Show]] & \" Season Info'!C2:J15\"), 8,1)","v":"2012-13"}]
["30 Rock","Season 7",7,{"$f":"A470& \" S\" &C470","v":"30 Rock S7"},135,10,"\"Florida\"","Claire Cowperthwaite","Tom Ceraulo & Matt Hubbard","2013-01-17",{"$f":"CHOOSE(WEEKDAY(J470),\"Sun\",\"Mon\",\"Tue\",\"Wed\",\"Thu\",\"Fri\",\"Sat\")","v":"Thu"},"20:00:00",710,3.44,469,"",{"$f":"VLOOKUP(EpisodeList[[#This Row],[Season Number]], INDIRECT(\"'\" & EpisodeList[[#This Row],[Show]] & \" Season Info'!C2:J15\"), 8,1)","v":"2012-13"}]
["Parks and Rec","Season 5",5,{"$f":"A471& \" S\" &C471","v":"Parks and Rec S5"},78,10,"\"Two Parties\"","Dean Holland","Dave King","2013-01-17",{"$f":"CHOOSE(WEEKDAY(J471),\"Sun\",\"Mon\",\"Tue\",\"Wed\",\"Thu\",\"Fri\",\"Sat\")","v":"Thu"},"20:30:00",null,3.92,470,"",{"$f":"VLOOKUP(EpisodeList[[#This Row],[Season Number]], INDIRECT(\"'\" & EpisodeList[[#This Row],[Show]] & \" Season Info'!C2:J15\"), 8,1)","v":"2012-13"}]
["The Office","Season 9",9,{"$f":"A472& \" S\" &C472","v":"The Office S9"},187,11,"\"Suit Warehouse\"","Matt Sohn","Dan Greaney","2013-01-17",{"$f":"CHOOSE(WEEKDAY(J472),\"Sun\",\"Mon\",\"Tue\",\"Wed\",\"Thu\",\"Fri\",\"Sat\")","v":"Thu"},"21:00:00",9012,4.1500000000000004,471,"",{"$f":"VLOOKUP(EpisodeList[[#This Row],[Season Number]], INDIRECT(\"'\" & EpisodeList[[#This Row],[Show]] & \" Season Info'!C2:J15\"), 8,1)","v":"2012-13"}]
["30 Rock","Season 7",7,{"$f":"A473& \" S\" &C473","v":"30 Rock S7"},136,11,"\"A Goon's Deed in a Weary World\"","Jeff Richmond","Lang Fisher & Nina Pedrad","2013-01-24",{"$f":"CHOOSE(WEEKDAY(J473),\"Sun\",\"Mon\",\"Tue\",\"Wed\",\"Thu\",\"Fri\",\"Sat\")","v":"Thu"},"20:00:00",711,3.81,472,"",{"$f":"VLOOKUP(EpisodeList[[#This Row],[Season Number]], INDIRECT(\"'\" & EpisodeList[[#This Row],[Show]] & \" Season Info'!C2:J15\"), 8,1)","v":"2012-13"}]
["Parks and Rec","Season 5",5,{"$f":"A474& \" S\" &C474","v":"Parks and Rec S5"},79,11,"\"Women in Garbage\"","Norm Hiscock","Harris Wittels","2013-01-24",{"$f":"CHOOSE(WEEKDAY(J474),\"Sun\",\"Mon\",\"Tue\",\"Wed\",\"Thu\",\"Fri\",\"Sat\")","v":"Thu"},"20:30:00",null,3.94,473,"",{"$f":"VLOOKUP(EpisodeList[[#This Row],[Season Number]], INDIRECT(\"'\" & EpisodeList[[#This Row],[Show]] & \" Season Info'!C2:J15\"), 8,1)","v":"2012-13"}]
["The Office","Season 9",9,{"$f":"A475& \" S\" &C475","v":"The Office S9"},188,12,"\"Customer Loyalty\"","Kelly Cantley","Jonathan Green & Gabe Miller","2013-01-24",{"$f":"CHOOSE(WEEKDAY(J475),\"Sun\",\"Mon\",\"Tue\",\"Wed\",\"Thu\",\"Fri\",\"Sat\")","v":"Thu"},"21:00:00",9013,4.1900000000000004,474,"",{"$f":"VLOOKUP(EpisodeList[[#This Row],[Season Number]], INDIRECT(\"'\" & EpisodeList[[#This Row],[Show]] & \" Season Info'!C2:J15\"), 8,1)","v":"2012-13"}]
["30 Rock","Season 7",7,{"$f":"A476& \" S\" &C476","v":"30 Rock S7"},137,12,"\"Hogcock!\"","Beth McCarthy-Miller","Jack Burditt & Robert Carlock","2013-01-31",{"$f":"CHOOSE(WEEKDAY(J476),\"Sun\",\"Mon\",\"Tue\",\"Wed\",\"Thu\",\"Fri\",\"Sat\")","v":"Thu"},"20:00:00",712,4.88,475,"",{"$f":"VLOOKUP(EpisodeList[[#This Row],[Season Number]], INDIRECT(\"'\" & EpisodeList[[#This Row],[Show]] & \" Season Info'!C2:J15\"), 8,1)","v":"2012-13"}]
["30 Rock","Season 7",7,{"$f":"A477& \" S\" &C477","v":"30 Rock S7"},138,13,"\"Last Lunch\"","Beth McCarthy-Miller","Tina Fey & Tracey Wigfield","2013-01-31",{"$f":"CHOOSE(WEEKDAY(J477),\"Sun\",\"Mon\",\"Tue\",\"Wed\",\"Thu\",\"Fri\",\"Sat\")","v":"Thu"},"20:00:00",713,4.88,476,"",{"$f":"VLOOKUP(EpisodeList[[#This Row],[Season Number]], INDIRECT(\"'\" & EpisodeList[[#This Row],[Show]] & \" Season Info'!C2:J15\"), 8,1)","v":"2012-13"}]
["The Office","Season 9",9,{"$f":"A478& \" S\" &C478","v":"The Office S9"},189,13,"\"Junior Salesman\"","David Rogers","Carrie Kemper","2013-01-31",{"$f":"CHOOSE(WEEKDAY(J478),\"Sun\",\"Mon\",\"Tue\",\"Wed\",\"Thu\",\"Fri\",\"Sat\")","v":"Thu"},"21:00:00",9014,4.45,477,"",{"$f":"VLOOKUP(EpisodeList[[#This Row],[Season Number]], INDIRECT(\"'\" & EpisodeList[[#This Row],[Show]] & \" Season Info'!C2:J15\"), 8,1)","v":"2012-13"}]
["The Office","Season 9",9,{"$f":"A479& \" S\" &C479","v":"The Office S9"},190,14,"\"Vandalism\"","Lee Kirk","Owen Ellickson","2013-01-31",{"$f":"CHOOSE(WEEKDAY(J479),\"Sun\",\"Mon\",\"Tue\",\"Wed\",\"Thu\",\"Fri\",\"Sat\")","v":"Thu"},"21:00:00",9015,3.97,478,"",{"$f":"VLOOKUP(EpisodeList[[#This Row],[Season Number]], INDIRECT(\"'\" & EpisodeList[[#This Row],[Show]] & \" Season Info'!C2:J15\"), 8,1)","v":"2012-13"}]
["Community","Season 4",4,{"$f":"A480& \" S\" &C480","v":"Community S4"},72,1,"\"History 101\"","Tristram Shapeero","Andy Bobrow","2013-02-07",{"$f":"CHOOSE(WEEKDAY(J480),\"Sun\",\"Mon\",\"Tue\",\"Wed\",\"Thu\",\"Fri\",\"Sat\")","v":"Thu"},"20:00:00",401,3.88,479,"",{"$f":"VLOOKUP(EpisodeList[[#This Row],[Season Number]], INDIRECT(\"'\" & EpisodeList[[#This Row],[Show]] & \" Season Info'!C2:J15\"), 8,1)","v":"2012-13"}]
["Parks and Rec","Season 5",5,{"$f":"A481& \" S\" &C481","v":"Parks and Rec S5"},80,12,"\"Ann's Decision\"","Ken Whittingham","Nate DiMeo","2013-02-07",{"$f":"CHOOSE(WEEKDAY(J481),\"Sun\",\"Mon\",\"Tue\",\"Wed\",\"Thu\",\"Fri\",\"Sat\")","v":"Thu"},"20:30:00",null,3.76,480,"",{"$f":"VLOOKUP(EpisodeList[[#This Row],[Season Number]], INDIRECT(\"'\" & EpisodeList[[#This Row],[Show]] & \" Season Info'!C2:J15\"), 8,1)","v":"2012-13"}]
["The Office","Season 9",9,{"$f":"A482& \" S\" &C482","v":"The Office S9"},191,15,"\"Couples Discount\"","Troy Miller","Allison Silverman","2013-02-07",{"$f":"CHOOSE(WEEKDAY(J482),\"Sun\",\"Mon\",\"Tue\",\"Wed\",\"Thu\",\"Fri\",\"Sat\")","v":"Thu"},"21:00:00",9016,4.1500000000000004,481,"",{"$f":"VLOOKUP(EpisodeList[[#This Row],[Season Number]], INDIRECT(\"'\" & EpisodeList[[#This Row],[Show]] & \" Season Info'!C2:J15\"), 8,1)","v":"2012-13"}]
["Community","Season 4",4,{"$f":"A483& \" S\" &C483","v":"Community S4"},73,2,"\"Paranormal Parentage\"","Tristram Shapeero","Megan Ganz","2013-02-14",{"$f":"CHOOSE(WEEKDAY(J483),\"Sun\",\"Mon\",\"Tue\",\"Wed\",\"Thu\",\"Fri\",\"Sat\")","v":"Thu"},"20:00:00",403,2.76,482,"",{"$f":"VLOOKUP(EpisodeList[[#This Row],[Season Number]], INDIRECT(\"'\" & EpisodeList[[#This Row],[Show]] & \" Season Info'!C2:J15\"), 8,1)","v":"2012-13"}]
["Parks and Rec","Season 5",5,{"$f":"A484& \" S\" &C484","v":"Parks and Rec S5"},81,13,"\"Emergency Response\"","Dean Holland","Norm Hiscock & Joe Mande","2013-02-14",{"$f":"CHOOSE(WEEKDAY(J484),\"Sun\",\"Mon\",\"Tue\",\"Wed\",\"Thu\",\"Fri\",\"Sat\")","v":"Thu"},"20:30:00",null,3.18,483,"",{"$f":"VLOOKUP(EpisodeList[[#This Row],[Season Number]], INDIRECT(\"'\" & EpisodeList[[#This Row],[Show]] & \" Season Info'!C2:J15\"), 8,1)","v":"2012-13"}]
["The Office","Season 9",9,{"$f":"A485& \" S\" &C485","v":"The Office S9"},192,16,"\"Moving On\"","Jon Favreau","Graham Wagner","2013-02-14",{"$f":"CHOOSE(WEEKDAY(J485),\"Sun\",\"Mon\",\"Tue\",\"Wed\",\"Thu\",\"Fri\",\"Sat\")","v":"Thu"},"21:00:00",9017,4.0599999999999996,484,"",{"$f":"VLOOKUP(EpisodeList[[#This Row],[Season Number]], INDIRECT(\"'\" & EpisodeList[[#This Row],[Show]] & \" Season Info'!C2:J15\"), 8,1)","v":"2012-13"}]
["Community","Season 4",4,{"$f":"A486& \" S\" &C486","v":"Community S4"},74,3,"\"Conventions of Space and Time\"","Michael Patrick Jann","Maggie Bandur","2013-02-21",{"$f":"CHOOSE(WEEKDAY(J486),\"Sun\",\"Mon\",\"Tue\",\"Wed\",\"Thu\",\"Fri\",\"Sat\")","v":"Thu"},"20:00:00",404,3.08,485,"",{"$f":"VLOOKUP(EpisodeList[[#This Row],[Season Number]], INDIRECT(\"'\" & EpisodeList[[#This Row],[Show]] & \" Season Info'!C2:J15\"), 8,1)","v":"2012-13"}]
["Parks and Rec","Season 5",5,{"$f":"A487& \" S\" &C487","v":"Parks and Rec S5"},82,14,"\"Leslie and Ben\"","Craig Zisk","Michael Schur & Alan Yang","2013-02-21",{"$f":"CHOOSE(WEEKDAY(J487),\"Sun\",\"Mon\",\"Tue\",\"Wed\",\"Thu\",\"Fri\",\"Sat\")","v":"Thu"},"20:30:00",null,3.07,486,"",{"$f":"VLOOKUP(EpisodeList[[#This Row],[Season Number]], INDIRECT(\"'\" & EpisodeList[[#This Row],[Show]] & \" Season Info'!C2:J15\"), 8,1)","v":"2012-13"}]
["Parks and Rec","Season 5",5,{"$f":"A488& \" S\" &C488","v":"Parks and Rec S5"},83,15,"\"Correspondents' Lunch\"","Nick Offerman","Alexandra Rushfield","2013-02-21",{"$f":"CHOOSE(WEEKDAY(J488),\"Sun\",\"Mon\",\"Tue\",\"Wed\",\"Thu\",\"Fri\",\"Sat\")","v":"Thu"},"20:30:00",null,2.95,487,"",{"$f":"VLOOKUP(EpisodeList[[#This Row],[Season Number]], INDIRECT(\"'\" & EpisodeList[[#This Row],[Show]] & \" Season Info'!C2:J15\"), 8,1)","v":"2012-13"}]
["Community","Season 4",4,{"$f":"A489& \" S\" &C489","v":"Community S4"},75,4,"\"Alternative History of the German Invasion\"","Steven Tsuchida","Ben Wexler","2013-02-28",{"$f":"CHOOSE(WEEKDAY(J489),\"Sun\",\"Mon\",\"Tue\",\"Wed\",\"Thu\",\"Fri\",\"Sat\")","v":"Thu"},"20:00:00",402,2.83,488,"",{"$f":"VLOOKUP(EpisodeList[[#This Row],[Season Number]], INDIRECT(\"'\" & EpisodeList[[#This Row],[Show]] & \" Season Info'!C2:J15\"), 8,1)","v":"2012-13"}]
["Community","Season 4",4,{"$f":"A490& \" S\" &C490","v":"Community S4"},76,5,"\"Cooperative Escapism in Familial Relations\"","Tristram Shapeero","Steve Basilone & Annie Mebane","2013-03-07",{"$f":"CHOOSE(WEEKDAY(J490),\"Sun\",\"Mon\",\"Tue\",\"Wed\",\"Thu\",\"Fri\",\"Sat\")","v":"Thu"},"20:00:00",405,3.29,489,"",{"$f":"VLOOKUP(EpisodeList[[#This Row],[Season Number]], INDIRECT(\"'\" & EpisodeList[[#This Row],[Show]] & \" Season Info'!C2:J15\"), 8,1)","v":"2012-13"}]
["Community","Season 4",4,{"$f":"A491& \" S\" &C491","v":"Community S4"},77,6,"\"Advanced Documentary Filmmaking\"","Jay Chandrasekhar","Hunter Covington","2013-03-14",{"$f":"CHOOSE(WEEKDAY(J491),\"Sun\",\"Mon\",\"Tue\",\"Wed\",\"Thu\",\"Fri\",\"Sat\")","v":"Thu"},"20:00:00",408,2.58,490,"",{"$f":"VLOOKUP(EpisodeList[[#This Row],[Season Number]], INDIRECT(\"'\" & EpisodeList[[#This Row],[Show]] & \" Season Info'!C2:J15\"), 8,1)","v":"2012-13"}]
["Parks and Rec","Season 5",5,{"$f":"A492& \" S\" &C492","v":"Parks and Rec S5"},84,16,"\"Bailout\"","Craig Zisk","Joe Mande","2013-03-14",{"$f":"CHOOSE(WEEKDAY(J492),\"Sun\",\"Mon\",\"Tue\",\"Wed\",\"Thu\",\"Fri\",\"Sat\")","v":"Thu"},"20:30:00",null,3,491,"",{"$f":"VLOOKUP(EpisodeList[[#This Row],[Season Number]], INDIRECT(\"'\" & EpisodeList[[#This Row],[Show]] & \" Season Info'!C2:J15\"), 8,1)","v":"2012-13"}]
["The Office","Season 9",9,{"$f":"A493& \" S\" &C493","v":"The Office S9"},193,17,"\"The Farm\"","Paul Lieberstein","Paul Lieberstein","2013-03-14",{"$f":"CHOOSE(WEEKDAY(J493),\"Sun\",\"Mon\",\"Tue\",\"Wed\",\"Thu\",\"Fri\",\"Sat\")","v":"Thu"},"21:00:00",9005,3.54,492,"",{"$f":"VLOOKUP(EpisodeList[[#This Row],[Season Number]], INDIRECT(\"'\" & EpisodeList[[#This Row],[Show]] & \" Season Info'!C2:J15\"), 8,1)","v":"2012-13"}]
["Community","Season 4",4,{"$f":"A494& \" S\" &C494","v":"Community S4"},78,7,"\"Economics of Marine Biology\"","Tricia Brock","Tim Saccardo","2013-03-21",{"$f":"CHOOSE(WEEKDAY(J494),\"Sun\",\"Mon\",\"Tue\",\"Wed\",\"Thu\",\"Fri\",\"Sat\")","v":"Thu"},"20:00:00",406,2.95,493,"",{"$f":"VLOOKUP(EpisodeList[[#This Row],[Season Number]], INDIRECT(\"'\" & EpisodeList[[#This Row],[Show]] & \" Season Info'!C2:J15\"), 8,1)","v":"2012-13"}]
["Community","Season 4",4,{"$f":"A495& \" S\" &C495","v":"Community S4"},79,8,"\"Herstory of Dance\"","Tristram Shapeero","Jack Kukoda","2013-04-04",{"$f":"CHOOSE(WEEKDAY(J495),\"Sun\",\"Mon\",\"Tue\",\"Wed\",\"Thu\",\"Fri\",\"Sat\")","v":"Thu"},"20:00:00",407,2.3199999999999998,494,"",{"$f":"VLOOKUP(EpisodeList[[#This Row],[Season Number]], INDIRECT(\"'\" & EpisodeList[[#This Row],[Show]] & \" Season Info'!C2:J15\"), 8,1)","v":"2012-13"}]
["Parks and Rec","Season 5",5,{"$f":"A496& \" S\" &C496","v":"Parks and Rec S5"},85,17,"\"Partridge\"","Tristram Shapeero","Dave King","2013-04-04",{"$f":"CHOOSE(WEEKDAY(J496),\"Sun\",\"Mon\",\"Tue\",\"Wed\",\"Thu\",\"Fri\",\"Sat\")","v":"Thu"},"20:30:00",null,2.93,495,"",{"$f":"VLOOKUP(EpisodeList[[#This Row],[Season Number]], INDIRECT(\"'\" & EpisodeList[[#This Row],[Show]] & \" Season Info'!C2:J15\"), 8,1)","v":"2012-13"}]
["The Office","Season 9",9,{"$f":"A497& \" S\" &C497","v":"The Office S9"},194,18,"\"Promos\"","Jennifer Celotta","Tim McAuliffe","2013-04-04",{"$f":"CHOOSE(WEEKDAY(J497),\"Sun\",\"Mon\",\"Tue\",\"Wed\",\"Thu\",\"Fri\",\"Sat\")","v":"Thu"},"21:00:00",9018,3.44,496,"",{"$f":"VLOOKUP(EpisodeList[[#This Row],[Season Number]], INDIRECT(\"'\" & EpisodeList[[#This Row],[Show]] & \" Season Info'!C2:J15\"), 8,1)","v":"2012-13"}]
["Community","Season 4",4,{"$f":"A498& \" S\" &C498","v":"Community S4"},80,9,"\"Intro to Felt Surrogacy\"","Tristram Shapeero","Gene Hong","2013-04-11",{"$f":"CHOOSE(WEEKDAY(J498),\"Sun\",\"Mon\",\"Tue\",\"Wed\",\"Thu\",\"Fri\",\"Sat\")","v":"Thu"},"20:00:00",413,2.84,497,"",{"$f":"VLOOKUP(EpisodeList[[#This Row],[Season Number]], INDIRECT(\"'\" & EpisodeList[[#This Row],[Show]] & \" Season Info'!C2:J15\"), 8,1)","v":"2012-13"}]
["Parks and Rec","Season 5",5,{"$f":"A499& \" S\" &C499","v":"Parks and Rec S5"},86,18,"\"Animal Control\"","Craig Zisk","Megan Amram","2013-04-11",{"$f":"CHOOSE(WEEKDAY(J499),\"Sun\",\"Mon\",\"Tue\",\"Wed\",\"Thu\",\"Fri\",\"Sat\")","v":"Thu"},"20:30:00",null,3.15,498,"",{"$f":"VLOOKUP(EpisodeList[[#This Row],[Season Number]], INDIRECT(\"'\" & EpisodeList[[#This Row],[Show]] & \" Season Info'!C2:J15\"), 8,1)","v":"2012-13"}]
["The Office","Season 9",9,{"$f":"A500& \" S\" &C500","v":"The Office S9"},195,19,"\"Stairmageddon\"","Matt Sohn","Dan Sterling","2013-04-11",{"$f":"CHOOSE(WEEKDAY(J500),\"Sun\",\"Mon\",\"Tue\",\"Wed\",\"Thu\",\"Fri\",\"Sat\")","v":"Thu"},"21:00:00",9019,3.83,499,"",{"$f":"VLOOKUP(EpisodeList[[#This Row],[Season Number]], INDIRECT(\"'\" & EpisodeList[[#This Row],[Show]] & \" Season Info'!C2:J15\"), 8,1)","v":"2012-13"}]
["Community","Season 4",4,{"$f":"A501& \" S\" &C501","v":"Community S4"},81,10,"\"Intro to Knots\"","Tristram Shapeero","Andy Bobrow","2013-04-18",{"$f":"CHOOSE(WEEKDAY(J501),\"Sun\",\"Mon\",\"Tue\",\"Wed\",\"Thu\",\"Fri\",\"Sat\")","v":"Thu"},"20:00:00",409,3.13,500,"",{"$f":"VLOOKUP(EpisodeList[[#This Row],[Season Number]], INDIRECT(\"'\" & EpisodeList[[#This Row],[Show]] & \" Season Info'!C2:J15\"), 8,1)","v":"2012-13"}]
["Parks and Rec","Season 5",5,{"$f":"A502& \" S\" &C502","v":"Parks and Rec S5"},87,19,"\"Article Two\"","Amy Poehler","Matt Murray","2013-04-18",{"$f":"CHOOSE(WEEKDAY(J502),\"Sun\",\"Mon\",\"Tue\",\"Wed\",\"Thu\",\"Fri\",\"Sat\")","v":"Thu"},"20:30:00",null,3.35,501,"",{"$f":"VLOOKUP(EpisodeList[[#This Row],[Season Number]], INDIRECT(\"'\" & EpisodeList[[#This Row],[Show]] & \" Season Info'!C2:J15\"), 8,1)","v":"2012-13"}]
["Parks and Rec","Season 5",5,{"$f":"A503& \" S\" &C503","v":"Parks and Rec S5"},88,20,"\"Jerry's Retirement\"","Nicole Holofcener","Norm Hiscock & Aisha Muharrar","2013-04-18",{"$f":"CHOOSE(WEEKDAY(J503),\"Sun\",\"Mon\",\"Tue\",\"Wed\",\"Thu\",\"Fri\",\"Sat\")","v":"Thu"},"20:30:00",null,3.34,502,"",{"$f":"VLOOKUP(EpisodeList[[#This Row],[Season Number]], INDIRECT(\"'\" & EpisodeList[[#This Row],[Show]] & \" Season Info'!C2:J15\"), 8,1)","v":"2012-13"}]
["Community","Season 4",4,{"$f":"A504& \" S\" &C504","v":"Community S4"},82,11,"\"Basic Human Anatomy\"","Beth McCarthy-Miller","Jim Rash","2013-04-25",{"$f":"CHOOSE(WEEKDAY(J504),\"Sun\",\"Mon\",\"Tue\",\"Wed\",\"Thu\",\"Fri\",\"Sat\")","v":"Thu"},"20:00:00",410,2.33,503,"",{"$f":"VLOOKUP(EpisodeList[[#This Row],[Season Number]], INDIRECT(\"'\" & EpisodeList[[#This Row],[Show]] & \" Season Info'!C2:J15\"), 8,1)","v":"2012-13"}]
["Parks and Rec","Season 5",5,{"$f":"A505& \" S\" &C505","v":"Parks and Rec S5"},89,21,"\"Swing Vote\"","Alan Yang","Joe Mande & Alan Yang","2013-04-25",{"$f":"CHOOSE(WEEKDAY(J505),\"Sun\",\"Mon\",\"Tue\",\"Wed\",\"Thu\",\"Fri\",\"Sat\")","v":"Thu"},"20:30:00",null,2.59,504,"",{"$f":"VLOOKUP(EpisodeList[[#This Row],[Season Number]], INDIRECT(\"'\" & EpisodeList[[#This Row],[Show]] & \" Season Info'!C2:J15\"), 8,1)","v":"2012-13"}]
["The Office","Season 9",9,{"$f":"A506& \" S\" &C506","v":"The Office S9"},196,20,"\"Paper Airplane\"","Jesse Peretz","Halsted Sullivan & Warren Lieberstein","2013-04-25",{"$f":"CHOOSE(WEEKDAY(J506),\"Sun\",\"Mon\",\"Tue\",\"Wed\",\"Thu\",\"Fri\",\"Sat\")","v":"Thu"},"21:00:00",9020,3.25,505,"",{"$f":"VLOOKUP(EpisodeList[[#This Row],[Season Number]], INDIRECT(\"'\" & EpisodeList[[#This Row],[Show]] & \" Season Info'!C2:J15\"), 8,1)","v":"2012-13"}]
["Community","Season 4",4,{"$f":"A507& \" S\" &C507","v":"Community S4"},83,12,"\"Heroic Origins\"","Victor Nelli, Jr.","Steve Basilone & Annie Mebane & Maggie Bandur","2013-05-02",{"$f":"CHOOSE(WEEKDAY(J507),\"Sun\",\"Mon\",\"Tue\",\"Wed\",\"Thu\",\"Fri\",\"Sat\")","v":"Thu"},"20:00:00",412,2.67,506,"",{"$f":"VLOOKUP(EpisodeList[[#This Row],[Season Number]], INDIRECT(\"'\" & EpisodeList[[#This Row],[Show]] & \" Season Info'!C2:J15\"), 8,1)","v":"2012-13"}]
["Parks and Rec","Season 5",5,{"$f":"A508& \" S\" &C508","v":"Parks and Rec S5"},90,22,"\"Are You Better Off?\"","Dean Holland","Michael Schur","2013-05-02",{"$f":"CHOOSE(WEEKDAY(J508),\"Sun\",\"Mon\",\"Tue\",\"Wed\",\"Thu\",\"Fri\",\"Sat\")","v":"Thu"},"20:30:00",null,2.99,507,"",{"$f":"VLOOKUP(EpisodeList[[#This Row],[Season Number]], INDIRECT(\"'\" & EpisodeList[[#This Row],[Show]] & \" Season Info'!C2:J15\"), 8,1)","v":"2012-13"}]
["The Office","Season 9",9,{"$f":"A509& \" S\" &C509","v":"The Office S9"},197,21,"\"Livin' the Dream\"","Jeffrey Blitz","Niki Schwartz-Wright","2013-05-02",{"$f":"CHOOSE(WEEKDAY(J509),\"Sun\",\"Mon\",\"Tue\",\"Wed\",\"Thu\",\"Fri\",\"Sat\")","v":"Thu"},"21:00:00",9021,3.51,508,"",{"$f":"VLOOKUP(EpisodeList[[#This Row],[Season Number]], INDIRECT(\"'\" & EpisodeList[[#This Row],[Show]] & \" Season Info'!C2:J15\"), 8,1)","v":"2012-13"}]
["Community","Season 4",4,{"$f":"A510& \" S\" &C510","v":"Community S4"},84,13,"\"Advanced Introduction to Finality\"","Tristram Shapeero","Megan Ganz","2013-05-09",{"$f":"CHOOSE(WEEKDAY(J510),\"Sun\",\"Mon\",\"Tue\",\"Wed\",\"Thu\",\"Fri\",\"Sat\")","v":"Thu"},"20:00:00",411,3.08,509,"",{"$f":"VLOOKUP(EpisodeList[[#This Row],[Season Number]], INDIRECT(\"'\" & EpisodeList[[#This Row],[Show]] & \" Season Info'!C2:J15\"), 8,1)","v":"2012-13"}]
["The Office","Season 9",9,{"$f":"A511& \" S\" &C511","v":"The Office S9"},198,22,"\"A.A.R.M.\"","David Rogers","Brent Forrester","2013-05-09",{"$f":"CHOOSE(WEEKDAY(J511),\"Sun\",\"Mon\",\"Tue\",\"Wed\",\"Thu\",\"Fri\",\"Sat\")","v":"Thu"},"21:00:00",9022,4.5599999999999996,510,"",{"$f":"VLOOKUP(EpisodeList[[#This Row],[Season Number]], INDIRECT(\"'\" & EpisodeList[[#This Row],[Show]] & \" Season Info'!C2:J15\"), 8,1)","v":"2012-13"}]
["The Office","Season 9",9,{"$f":"A512& \" S\" &C512","v":"The Office S9"},199,23,"\"A.A.R.M.\"","David Rogers","Brent Forrester","2013-05-09",{"$f":"CHOOSE(WEEKDAY(J512),\"Sun\",\"Mon\",\"Tue\",\"Wed\",\"Thu\",\"Fri\",\"Sat\")","v":"Thu"},"21:30:00",9023,4.5599999999999996,511,"",{"$f":"VLOOKUP(EpisodeList[[#This Row],[Season Number]], INDIRECT(\"'\" & EpisodeList[[#This Row],[Show]] & \" Season Info'!C2:J15\"), 8,1)","v":"2012-13"}]
["The Office","Season 9",9,{"$f":"A513& \" S\" &C513","v":"The Office S9"},200,24,"\"Finale\"*","Ken Kwapis","Greg Daniels","2013-05-16",{"$f":"CHOOSE(WEEKDAY(J513),\"Sun\",\"Mon\",\"Tue\",\"Wed\",\"Thu\",\"Fri\",\"Sat\")","v":"Thu"},"21:00:00",9024,5.69,512,"",{"$f":"VLOOKUP(EpisodeList[[#This Row],[Season Number]], INDIRECT(\"'\" & EpisodeList[[#This Row],[Show]] & \" Season Info'!C2:J15\"), 8,1)","v":"2012-13"}]
["The Office","Season 9",9,{"$f":"A514& \" S\" &C514","v":"The Office S9"},201,25,"\"Finale\"*","Ken Kwapis","Greg Daniels","2013-05-16",{"$f":"CHOOSE(WEEKDAY(J514),\"Sun\",\"Mon\",\"Tue\",\"Wed\",\"Thu\",\"Fri\",\"Sat\")","v":"Thu"},"21:30:00",9025,5.69,513,{"$f":"IF(AND(\n    COUNTIFS(A:A, A514, J:J, J514) = 1,\n    COUNTIFS(A:A, \"30 Rock\", J:J, J514) = 1,\n    COUNTIFS(A:A, \"The Office\", J:J, J514) = 1,\n    COUNTIFS(A:A, \"Community\", J:J, J514) = 1,\n    COUNTIFS(A:A, \"Parks and Rec\", J:J, J514) = 1\n), \"Yes\", \"\")","v":""},{"$f":"VLOOKUP(EpisodeList[[#This Row],[Season Number]], INDIRECT(\"'\" & EpisodeList[[#This Row],[Show]] & \" Season Info'!C2:J15\"), 8,1)","v":"2012-13"}]
["Parks and Rec","Season 6",6,{"$f":"A515& \" S\" &C515","v":"Parks and Rec S6"},91,1,"\"London\"","Dean Holland","Michael Schur","2013-09-26",{"$f":"CHOOSE(WEEKDAY(J515),\"Sun\",\"Mon\",\"Tue\",\"Wed\",\"Thu\",\"Fri\",\"Sat\")","v":"Thu"},"20:00:00",null,3.27,514,"",{"$f":"VLOOKUP(EpisodeList[[#This Row],[Season Number]], INDIRECT(\"'\" & EpisodeList[[#This Row],[Show]] & \" Season Info'!C2:J15\"), 8,1)","v":"2013-14"}]
["Parks and Rec","Season 6",6,{"$f":"A516& \" S\" &C516","v":"Parks and Rec S6"},92,2,"\"London\"","Dean Holland","Michael Schur","2013-09-26",{"$f":"CHOOSE(WEEKDAY(J516),\"Sun\",\"Mon\",\"Tue\",\"Wed\",\"Thu\",\"Fri\",\"Sat\")","v":"Thu"},"20:00:00",null,3.27,515,"",{"$f":"VLOOKUP(EpisodeList[[#This Row],[Season Number]], INDIRECT(\"'\" & EpisodeList[[#This Row],[Show]] & \" Season Info'!C2:J15\"), 8,1)","v":"2013-14"}]
["Parks and Rec","Season 6",6,{"$f":"A517& \" S\" &C517","v":"Parks and Rec S6"},93,3,"\"The Pawnee-Eagleton Tip Off Classic\"","Nicole Holofcener","Alan Yang","2013-10-03",{"$f":"CHOOSE(WEEKDAY(J517),\"Sun\",\"Mon\",\"Tue\",\"Wed\",\"Thu\",\"Fri\",\"Sat\")","v":"Thu"},"20:00:00",null,3.14,516,"",{"$f":"VLOOKUP(EpisodeList[[#This Row],[Season Number]], INDIRECT(\"'\" & EpisodeList[[#This Row],[Show]] & \" Season Info'!C2:J15\"), 8,1)","v":"2013-14"}]
["Parks and Rec","Season 6",6,{"$f":"A518& \" S\" &C518","v":"Parks and Rec S6"},94,4,"\"Doppelg√§ngers\"","Jay Karas","Donick Cary","2013-10-10",{"$f":"CHOOSE(WEEKDAY(J518),\"Sun\",\"Mon\",\"Tue\",\"Wed\",\"Thu\",\"Fri\",\"Sat\")","v":"Thu"},"20:00:00",null,3.23,517,"",{"$f":"VLOOKUP(EpisodeList[[#This Row],[Season Number]], INDIRECT(\"'\" & EpisodeList[[#This Row],[Show]] & \" Season Info'!C2:J15\"), 8,1)","v":"2013-14"}]
["Parks and Rec","Season 6",6,{"$f":"A519& \" S\" &C519","v":"Parks and Rec S6"},95,5,"\"Gin It Up!\"","Jorma Taccone","Matt Murray","2013-10-17",{"$f":"CHOOSE(WEEKDAY(J519),\"Sun\",\"Mon\",\"Tue\",\"Wed\",\"Thu\",\"Fri\",\"Sat\")","v":"Thu"},"20:00:00",null,3.27,518,"",{"$f":"VLOOKUP(EpisodeList[[#This Row],[Season Number]], INDIRECT(\"'\" & EpisodeList[[#This Row],[Show]] & \" Season Info'!C2:J15\"), 8,1)","v":"2013-14"}]
["Parks and Rec","Season 6",6,{"$f":"A520& \" S\" &C520","v":"Parks and Rec S6"},96,6,"\"Filibuster\"","Morgan Sackett","Harris Wittels","2013-11-14",{"$f":"CHOOSE(WEEKDAY(J520),\"Sun\",\"Mon\",\"Tue\",\"Wed\",\"Thu\",\"Fri\",\"Sat\")","v":"Thu"},"20:00:00",null,3.03,519,"",{"$f":"VLOOKUP(EpisodeList[[#This Row],[Season Number]], INDIRECT(\"'\" & EpisodeList[[#This Row],[Show]] & \" Season Info'!C2:J15\"), 8,1)","v":"2013-14"}]
["Parks and Rec","Season 6",6,{"$f":"A521& \" S\" &C521","v":"Parks and Rec S6"},97,7,"\"Recall Vote\"","Wendey Stanzler","Aisha Muharrar","2013-11-14",{"$f":"CHOOSE(WEEKDAY(J521),\"Sun\",\"Mon\",\"Tue\",\"Wed\",\"Thu\",\"Fri\",\"Sat\")","v":"Thu"},"20:00:00",null,3.03,520,"",{"$f":"VLOOKUP(EpisodeList[[#This Row],[Season Number]], INDIRECT(\"'\" & EpisodeList[[#This Row],[Show]] & \" Season Info'!C2:J15\"), 8,1)","v":"2013-14"}]
["Parks and Rec","Season 6",6,{"$f":"A522& \" S\" &C522","v":"Parks and Rec S6"},98,8,"\"Fluoride\"","Michael Trim","Matt Hubbard","2013-11-21",{"$f":"CHOOSE(WEEKDAY(J522),\"Sun\",\"Mon\",\"Tue\",\"Wed\",\"Thu\",\"Fri\",\"Sat\")","v":"Thu"},"20:00:00",null,2.81,521,"",{"$f":"VLOOKUP(EpisodeList[[#This Row],[Season Number]], INDIRECT(\"'\" & EpisodeList[[#This Row],[Show]] & \" Season Info'!C2:J15\"), 8,1)","v":"2013-14"}]
["Parks and Rec","Season 6",6,{"$f":"A523& \" S\" &C523","v":"Parks and Rec S6"},99,9,"\"The Cones of Dunshire\"","Julie Anne Robinson","Dave King","2013-11-21",{"$f":"CHOOSE(WEEKDAY(J523),\"Sun\",\"Mon\",\"Tue\",\"Wed\",\"Thu\",\"Fri\",\"Sat\")","v":"Thu"},"20:00:00",null,2.81,522,"",{"$f":"VLOOKUP(EpisodeList[[#This Row],[Season Number]], INDIRECT(\"'\" & EpisodeList[[#This Row],[Show]] & \" Season Info'!C2:J15\"), 8,1)","v":"2013-14"}]
["Community","Season 5",5,{"$f":"A524& \" S\" &C524","v":"Community S5"},85,1,"\"Repilot\"","Tristram Shapeero","Dan Harmon & Chris McKenna","2014-01-02",{"$f":"CHOOSE(WEEKDAY(J524),\"Sun\",\"Mon\",\"Tue\",\"Wed\",\"Thu\",\"Fri\",\"Sat\")","v":"Thu"},"20:00:00",501,3.49,523,"",{"$f":"VLOOKUP(EpisodeList[[#This Row],[Season Number]], INDIRECT(\"'\" & EpisodeList[[#This Row],[Show]] & \" Season Info'!C2:J15\"), 8,1)","v":"2013-14"}]
["Community","Season 5",5,{"$f":"A525& \" S\" &C525","v":"Community S5"},86,2,"\"Introduction to Teaching\"","Jay Chandrasekhar","Andy Bobrow","2014-01-02",{"$f":"CHOOSE(WEEKDAY(J525),\"Sun\",\"Mon\",\"Tue\",\"Wed\",\"Thu\",\"Fri\",\"Sat\")","v":"Thu"},"20:00:00",502,3.49,524,"",{"$f":"VLOOKUP(EpisodeList[[#This Row],[Season Number]], INDIRECT(\"'\" & EpisodeList[[#This Row],[Show]] & \" Season Info'!C2:J15\"), 8,1)","v":"2013-14"}]
["Community","Season 5",5,{"$f":"A526& \" S\" &C526","v":"Community S5"},87,3,"\"Basic Intergluteal Numismatics\"","Tristram Shapeero","Erik Sommers","2014-01-09",{"$f":"CHOOSE(WEEKDAY(J526),\"Sun\",\"Mon\",\"Tue\",\"Wed\",\"Thu\",\"Fri\",\"Sat\")","v":"Thu"},"20:00:00",505,3.58,525,"",{"$f":"VLOOKUP(EpisodeList[[#This Row],[Season Number]], INDIRECT(\"'\" & EpisodeList[[#This Row],[Show]] & \" Season Info'!C2:J15\"), 8,1)","v":"2013-14"}]
["Parks and Rec","Season 6",6,{"$f":"A527& \" S\" &C527","v":"Parks and Rec S6"},100,10,"\"Second Chunce\"","Dean Holland","Amy Poehler & Michael Schur","2014-01-09",{"$f":"CHOOSE(WEEKDAY(J527),\"Sun\",\"Mon\",\"Tue\",\"Wed\",\"Thu\",\"Fri\",\"Sat\")","v":"Thu"},"20:30:00",null,3.43,526,"",{"$f":"VLOOKUP(EpisodeList[[#This Row],[Season Number]], INDIRECT(\"'\" & EpisodeList[[#This Row],[Show]] & \" Season Info'!C2:J15\"), 8,1)","v":"2013-14"}]
["Community","Season 5",5,{"$f":"A528& \" S\" &C528","v":"Community S5"},88,4,"\"Cooperative Polygraphy\"","Tristram Shapeero","Alex Rubens","2014-01-16",{"$f":"CHOOSE(WEEKDAY(J528),\"Sun\",\"Mon\",\"Tue\",\"Wed\",\"Thu\",\"Fri\",\"Sat\")","v":"Thu"},"20:00:00",503,3.07,527,"",{"$f":"VLOOKUP(EpisodeList[[#This Row],[Season Number]], INDIRECT(\"'\" & EpisodeList[[#This Row],[Show]] & \" Season Info'!C2:J15\"), 8,1)","v":"2013-14"}]
["Parks and Rec","Season 6",6,{"$f":"A529& \" S\" &C529","v":"Parks and Rec S6"},101,11,"\"New Beginnings\"","Alan Yang","Sam Means","2014-01-16",{"$f":"CHOOSE(WEEKDAY(J529),\"Sun\",\"Mon\",\"Tue\",\"Wed\",\"Thu\",\"Fri\",\"Sat\")","v":"Thu"},"20:30:00",null,3.05,528,"",{"$f":"VLOOKUP(EpisodeList[[#This Row],[Season Number]], INDIRECT(\"'\" & EpisodeList[[#This Row],[Show]] & \" Season Info'!C2:J15\"), 8,1)","v":"2013-14"}]
["Community","Season 5",5,{"$f":"A530& \" S\" &C530","v":"Community S5"},89,5,"\"Geothermal Escapism\"","Joe Russo","Tim Saccardo","2014-01-23",{"$f":"CHOOSE(WEEKDAY(J530),\"Sun\",\"Mon\",\"Tue\",\"Wed\",\"Thu\",\"Fri\",\"Sat\")","v":"Thu"},"20:00:00",504,3.02,529,"",{"$f":"VLOOKUP(EpisodeList[[#This Row],[Season Number]], INDIRECT(\"'\" & EpisodeList[[#This Row],[Show]] & \" Season Info'!C2:J15\"), 8,1)","v":"2013-14"}]
["Parks and Rec","Season 6",6,{"$f":"A531& \" S\" &C531","v":"Parks and Rec S6"},102,12,"\"Farmers Market\"","Adam Scott","Joe Mande","2014-01-23",{"$f":"CHOOSE(WEEKDAY(J531),\"Sun\",\"Mon\",\"Tue\",\"Wed\",\"Thu\",\"Fri\",\"Sat\")","v":"Thu"},"20:30:00",null,2.98,530,"",{"$f":"VLOOKUP(EpisodeList[[#This Row],[Season Number]], INDIRECT(\"'\" & EpisodeList[[#This Row],[Show]] & \" Season Info'!C2:J15\"), 8,1)","v":"2013-14"}]
["Community","Season 5",5,{"$f":"A532& \" S\" &C532","v":"Community S5"},90,6,"\"Analysis of Cork-Based Networking\"","Tristram Shapeero","Monica Padrick","2014-01-30",{"$f":"CHOOSE(WEEKDAY(J532),\"Sun\",\"Mon\",\"Tue\",\"Wed\",\"Thu\",\"Fri\",\"Sat\")","v":"Thu"},"20:00:00",506,3.01,531,"",{"$f":"VLOOKUP(EpisodeList[[#This Row],[Season Number]], INDIRECT(\"'\" & EpisodeList[[#This Row],[Show]] & \" Season Info'!C2:J15\"), 8,1)","v":"2013-14"}]
["Parks and Rec","Season 6",6,{"$f":"A533& \" S\" &C533","v":"Parks and Rec S6"},103,13,"\"Ann and Chris\"","Dean Holland","Aisha Muharrar & Michael Schur","2014-01-30",{"$f":"CHOOSE(WEEKDAY(J533),\"Sun\",\"Mon\",\"Tue\",\"Wed\",\"Thu\",\"Fri\",\"Sat\")","v":"Thu"},"20:30:00",null,3.03,532,"",{"$f":"VLOOKUP(EpisodeList[[#This Row],[Season Number]], INDIRECT(\"'\" & EpisodeList[[#This Row],[Show]] & \" Season Info'!C2:J15\"), 8,1)","v":"2013-14"}]
["Community","Season 5",5,{"$f":"A534& \" S\" &C534","v":"Community S5"},91,7,"\"Bondage and Beta Male Sexuality\"","Tristram Shapeero","Dan Guterman","2014-02-27",{"$f":"CHOOSE(WEEKDAY(J534),\"Sun\",\"Mon\",\"Tue\",\"Wed\",\"Thu\",\"Fri\",\"Sat\")","v":"Thu"},"20:00:00",507,2.56,533,"",{"$f":"VLOOKUP(EpisodeList[[#This Row],[Season Number]], INDIRECT(\"'\" & EpisodeList[[#This Row],[Show]] & \" Season Info'!C2:J15\"), 8,1)","v":"2013-14"}]
["Parks and Rec","Season 6",6,{"$f":"A535& \" S\" &C535","v":"Parks and Rec S6"},104,14,"\"Anniversaries\"","Morgan Sackett","Megan Amram","2014-02-27",{"$f":"CHOOSE(WEEKDAY(J535),\"Sun\",\"Mon\",\"Tue\",\"Wed\",\"Thu\",\"Fri\",\"Sat\")","v":"Thu"},"20:30:00",null,2.52,534,"",{"$f":"VLOOKUP(EpisodeList[[#This Row],[Season Number]], INDIRECT(\"'\" & EpisodeList[[#This Row],[Show]] & \" Season Info'!C2:J15\"), 8,1)","v":"2013-14"}]
["Community","Season 5",5,{"$f":"A536& \" S\" &C536","v":"Community S5"},92,8,"\"App Development and Condiments\"","Rob Schrab","Jordan Blum & Parker Deay","2014-03-06",{"$f":"CHOOSE(WEEKDAY(J536),\"Sun\",\"Mon\",\"Tue\",\"Wed\",\"Thu\",\"Fri\",\"Sat\")","v":"Thu"},"20:00:00",508,2.79,535,"",{"$f":"VLOOKUP(EpisodeList[[#This Row],[Season Number]], INDIRECT(\"'\" & EpisodeList[[#This Row],[Show]] & \" Season Info'!C2:J15\"), 8,1)","v":"2013-14"}]
["Parks and Rec","Season 6",6,{"$f":"A537& \" S\" &C537","v":"Parks and Rec S6"},105,15,"\"The Wall\"","Ken Whittingham","Jen Statsky","2014-03-06",{"$f":"CHOOSE(WEEKDAY(J537),\"Sun\",\"Mon\",\"Tue\",\"Wed\",\"Thu\",\"Fri\",\"Sat\")","v":"Thu"},"20:30:00",null,2.95,536,"",{"$f":"VLOOKUP(EpisodeList[[#This Row],[Season Number]], INDIRECT(\"'\" & EpisodeList[[#This Row],[Show]] & \" Season Info'!C2:J15\"), 8,1)","v":"2013-14"}]
["Community","Season 5",5,{"$f":"A538& \" S\" &C538","v":"Community S5"},93,9,"\"VCR Maintenance and Educational Publishing\"","Tristram Shapeero","Donald Diego","2014-03-13",{"$f":"CHOOSE(WEEKDAY(J538),\"Sun\",\"Mon\",\"Tue\",\"Wed\",\"Thu\",\"Fri\",\"Sat\")","v":"Thu"},"20:00:00",509,2.77,537,"",{"$f":"VLOOKUP(EpisodeList[[#This Row],[Season Number]], INDIRECT(\"'\" & EpisodeList[[#This Row],[Show]] & \" Season Info'!C2:J15\"), 8,1)","v":"2013-14"}]
["Parks and Rec","Season 6",6,{"$f":"A539& \" S\" &C539","v":"Parks and Rec S6"},106,16,"\"New Slogan\"","Dean Holland","Alan Yang & Sam Means","2014-03-13",{"$f":"CHOOSE(WEEKDAY(J539),\"Sun\",\"Mon\",\"Tue\",\"Wed\",\"Thu\",\"Fri\",\"Sat\")","v":"Thu"},"20:30:00",null,2.72,538,"",{"$f":"VLOOKUP(EpisodeList[[#This Row],[Season Number]], INDIRECT(\"'\" & EpisodeList[[#This Row],[Show]] & \" Season Info'!C2:J15\"), 8,1)","v":"2013-14"}]
["Community","Season 5",5,{"$f":"A540& \" S\" &C540","v":"Community S5"},94,10,"\"Advanced Advanced Dungeons & Dragons\"","Joe Russo","Matt Roller","2014-03-20",{"$f":"CHOOSE(WEEKDAY(J540),\"Sun\",\"Mon\",\"Tue\",\"Wed\",\"Thu\",\"Fri\",\"Sat\")","v":"Thu"},"20:00:00",510,3.32,539,"",{"$f":"VLOOKUP(EpisodeList[[#This Row],[Season Number]], INDIRECT(\"'\" & EpisodeList[[#This Row],[Show]] & \" Season Info'!C2:J15\"), 8,1)","v":"2013-14"}]
["Parks and Rec","Season 6",6,{"$f":"A541& \" S\" &C541","v":"Parks and Rec S6"},107,17,"\"Galentine's Day\"","Beth McCarthy-Miller","Emma Fletcher & Rachna Fruchbom","2014-03-20",{"$f":"CHOOSE(WEEKDAY(J541),\"Sun\",\"Mon\",\"Tue\",\"Wed\",\"Thu\",\"Fri\",\"Sat\")","v":"Thu"},"20:30:00",null,3.05,540,"",{"$f":"VLOOKUP(EpisodeList[[#This Row],[Season Number]], INDIRECT(\"'\" & EpisodeList[[#This Row],[Show]] & \" Season Info'!C2:J15\"), 8,1)","v":"2013-14"}]
["Community","Season 5",5,{"$f":"A542& \" S\" &C542","v":"Community S5"},95,11,"\"G.I. Jeff\"","Rob Schrab","Dino Stamatopoulos","2014-04-03",{"$f":"CHOOSE(WEEKDAY(J542),\"Sun\",\"Mon\",\"Tue\",\"Wed\",\"Thu\",\"Fri\",\"Sat\")","v":"Thu"},"20:00:00",513,2.5,541,"",{"$f":"VLOOKUP(EpisodeList[[#This Row],[Season Number]], INDIRECT(\"'\" & EpisodeList[[#This Row],[Show]] & \" Season Info'!C2:J15\"), 8,1)","v":"2013-14"}]
["Parks and Rec","Season 6",6,{"$f":"A543& \" S\" &C543","v":"Parks and Rec S6"},108,18,"\"Prom\"","Ken Whittingham","Matt Murray & Harris Wittels","2014-04-03",{"$f":"CHOOSE(WEEKDAY(J543),\"Sun\",\"Mon\",\"Tue\",\"Wed\",\"Thu\",\"Fri\",\"Sat\")","v":"Thu"},"20:30:00",null,2.67,542,"",{"$f":"VLOOKUP(EpisodeList[[#This Row],[Season Number]], INDIRECT(\"'\" & EpisodeList[[#This Row],[Show]] & \" Season Info'!C2:J15\"), 8,1)","v":"2013-14"}]
["Community","Season 5",5,{"$f":"A544& \" S\" &C544","v":"Community S5"},96,12,"\"Basic Story\"","Jay Chandrasekhar","Carol Kolb","2014-04-10",{"$f":"CHOOSE(WEEKDAY(J544),\"Sun\",\"Mon\",\"Tue\",\"Wed\",\"Thu\",\"Fri\",\"Sat\")","v":"Thu"},"20:00:00",512,2.56,543,"",{"$f":"VLOOKUP(EpisodeList[[#This Row],[Season Number]], INDIRECT(\"'\" & EpisodeList[[#This Row],[Show]] & \" Season Info'!C2:J15\"), 8,1)","v":"2013-14"}]
["Parks and Rec","Season 6",6,{"$f":"A545& \" S\" &C545","v":"Parks and Rec S6"},109,19,"\"Flu Season 2\"","Nick Offerman","Megan Amram & Dave King","2014-04-10",{"$f":"CHOOSE(WEEKDAY(J545),\"Sun\",\"Mon\",\"Tue\",\"Wed\",\"Thu\",\"Fri\",\"Sat\")","v":"Thu"},"20:30:00",null,2.56,544,"",{"$f":"VLOOKUP(EpisodeList[[#This Row],[Season Number]], INDIRECT(\"'\" & EpisodeList[[#This Row],[Show]] & \" Season Info'!C2:J15\"), 8,1)","v":"2013-14"}]
["Community","Season 5",5,{"$f":"A546& \" S\" &C546","v":"Community S5"},97,13,"\"Basic Sandwich\"","Rob Schrab","Ryan Ridley","2014-04-17",{"$f":"CHOOSE(WEEKDAY(J546),\"Sun\",\"Mon\",\"Tue\",\"Wed\",\"Thu\",\"Fri\",\"Sat\")","v":"Thu"},"20:00:00",511,2.87,545,"",{"$f":"VLOOKUP(EpisodeList[[#This Row],[Season Number]], INDIRECT(\"'\" & EpisodeList[[#This Row],[Show]] & \" Season Info'!C2:J15\"), 8,1)","v":"2013-14"}]
["Parks and Rec","Season 6",6,{"$f":"A547& \" S\" &C547","v":"Parks and Rec S6"},110,20,"\"One in 8,000\"","Dean Holland","Donick Cary & Joe Mande","2014-04-17",{"$f":"CHOOSE(WEEKDAY(J547),\"Sun\",\"Mon\",\"Tue\",\"Wed\",\"Thu\",\"Fri\",\"Sat\")","v":"Thu"},"20:30:00",null,2.39,546,"",{"$f":"VLOOKUP(EpisodeList[[#This Row],[Season Number]], INDIRECT(\"'\" & EpisodeList[[#This Row],[Show]] & \" Season Info'!C2:J15\"), 8,1)","v":"2013-14"}]
["Parks and Rec","Season 6",6,{"$f":"A548& \" S\" &C548","v":"Parks and Rec S6"},111,21,"\"Moving Up\"","Michael Schur","Aisha Muharrar & Alan Yang","2014-04-24",{"$f":"CHOOSE(WEEKDAY(J548),\"Sun\",\"Mon\",\"Tue\",\"Wed\",\"Thu\",\"Fri\",\"Sat\")","v":"Thu"},"20:30:00",null,2.71,547,"",{"$f":"VLOOKUP(EpisodeList[[#This Row],[Season Number]], INDIRECT(\"'\" & EpisodeList[[#This Row],[Show]] & \" Season Info'!C2:J15\"), 8,1)","v":"2013-14"}]
["Parks and Rec","Season 6",6,{"$f":"A549& \" S\" &C549","v":"Parks and Rec S6"},112,22,"\"Moving Up\"","Michael Schur","Aisha Muharrar & Alan Yang","2014-04-24",{"$f":"CHOOSE(WEEKDAY(J549),\"Sun\",\"Mon\",\"Tue\",\"Wed\",\"Thu\",\"Fri\",\"Sat\")","v":"Thu"},"21:00:00",null,2.71,548,"",{"$f":"VLOOKUP(EpisodeList[[#This Row],[Season Number]], INDIRECT(\"'\" & EpisodeList[[#This Row],[Show]] & \" Season Info'!C2:J15\"), 8,1)","v":"2013-14"}]
["Parks and Rec","Season 7",7,{"$f":"A550& \" S\" &C550","v":"Parks and Rec S7"},113,1,"\"2017\"","Dean Holland","Alan Yang & Matt Murray","2015-01-13",{"$f":"CHOOSE(WEEKDAY(J550),\"Sun\",\"Mon\",\"Tue\",\"Wed\",\"Thu\",\"Fri\",\"Sat\")","v":"Tue"},"20:00:00",null,3.75,549,"",{"$f":"VLOOKUP(EpisodeList[[#This Row],[Season Number]], INDIRECT(\"'\" & EpisodeList[[#This Row],[Show]] & \" Season Info'!C2:J15\"), 8,1)","v":"2014-15"}]
["Parks and Rec","Season 7",7,{"$f":"A551& \" S\" &C551","v":"Parks and Rec S7"},114,2,"\"Ron and Jammy\"","Dean Holland","Harris Wittels","2015-01-13",{"$f":"CHOOSE(WEEKDAY(J551),\"Sun\",\"Mon\",\"Tue\",\"Wed\",\"Thu\",\"Fri\",\"Sat\")","v":"Tue"},"20:30:00",null,3.25,550,"",{"$f":"VLOOKUP(EpisodeList[[#This Row],[Season Number]], INDIRECT(\"'\" & EpisodeList[[#This Row],[Show]] & \" Season Info'!C2:J15\"), 8,1)","v":"2014-15"}]
["Parks and Rec","Season 7",7,{"$f":"A552& \" S\" &C552","v":"Parks and Rec S7"},115,3,"\"William Henry Harrison\"","Tom Magill","Megan Amram","2015-01-20",{"$f":"CHOOSE(WEEKDAY(J552),\"Sun\",\"Mon\",\"Tue\",\"Wed\",\"Thu\",\"Fri\",\"Sat\")","v":"Tue"},"20:00:00",null,3.87,551,"",{"$f":"VLOOKUP(EpisodeList[[#This Row],[Season Number]], INDIRECT(\"'\" & EpisodeList[[#This Row],[Show]] & \" Season Info'!C2:J15\"), 8,1)","v":"2014-15"}]
["Parks and Rec","Season 7",7,{"$f":"A553& \" S\" &C553","v":"Parks and Rec S7"},116,4,"\"Leslie and Ron\"","Beth McCarthy-Miller","Michael Schur","2015-01-20",{"$f":"CHOOSE(WEEKDAY(J553),\"Sun\",\"Mon\",\"Tue\",\"Wed\",\"Thu\",\"Fri\",\"Sat\")","v":"Tue"},"20:30:00",null,3.3,552,"",{"$f":"VLOOKUP(EpisodeList[[#This Row],[Season Number]], INDIRECT(\"'\" & EpisodeList[[#This Row],[Show]] & \" Season Info'!C2:J15\"), 8,1)","v":"2014-15"}]
["Parks and Rec","Season 7",7,{"$f":"A554& \" S\" &C554","v":"Parks and Rec S7"},117,5,"\"Gryzzlbox\"","Amy Poehler","Donick Cary","2015-01-27",{"$f":"CHOOSE(WEEKDAY(J554),\"Sun\",\"Mon\",\"Tue\",\"Wed\",\"Thu\",\"Fri\",\"Sat\")","v":"Tue"},"20:00:00",null,3.48,553,"",{"$f":"VLOOKUP(EpisodeList[[#This Row],[Season Number]], INDIRECT(\"'\" & EpisodeList[[#This Row],[Show]] & \" Season Info'!C2:J15\"), 8,1)","v":"2014-15"}]
["Parks and Rec","Season 7",7,{"$f":"A555& \" S\" &C555","v":"Parks and Rec S7"},118,6,"\"Save JJ's\"","Ken Whittingham","Joe Mande","2015-01-27",{"$f":"CHOOSE(WEEKDAY(J555),\"Sun\",\"Mon\",\"Tue\",\"Wed\",\"Thu\",\"Fri\",\"Sat\")","v":"Tue"},"20:30:00",null,2.97,554,"",{"$f":"VLOOKUP(EpisodeList[[#This Row],[Season Number]], INDIRECT(\"'\" & EpisodeList[[#This Row],[Show]] & \" Season Info'!C2:J15\"), 8,1)","v":"2014-15"}]
["Parks and Rec","Season 7",7,{"$f":"A556& \" S\" &C556","v":"Parks and Rec S7"},119,7,"\"Donna and Joe\"","Ken Whittingham","Aisha Muharrar","2015-02-03",{"$f":"CHOOSE(WEEKDAY(J556),\"Sun\",\"Mon\",\"Tue\",\"Wed\",\"Thu\",\"Fri\",\"Sat\")","v":"Tue"},"20:00:00",null,3.45,555,"",{"$f":"VLOOKUP(EpisodeList[[#This Row],[Season Number]], INDIRECT(\"'\" & EpisodeList[[#This Row],[Show]] & \" Season Info'!C2:J15\"), 8,1)","v":"2014-15"}]
["Parks and Rec","Season 7",7,{"$f":"A557& \" S\" &C557","v":"Parks and Rec S7"},120,8,"\"Ms. Ludgate-Dwyer Goes to Washington\"","Morgan Sackett","Dave King","2015-02-10",{"$f":"CHOOSE(WEEKDAY(J557),\"Sun\",\"Mon\",\"Tue\",\"Wed\",\"Thu\",\"Fri\",\"Sat\")","v":"Tue"},"20:00:00",null,3.06,556,"",{"$f":"VLOOKUP(EpisodeList[[#This Row],[Season Number]], INDIRECT(\"'\" & EpisodeList[[#This Row],[Show]] & \" Season Info'!C2:J15\"), 8,1)","v":"2014-15"}]
["Parks and Rec","Season 7",7,{"$f":"A558& \" S\" &C558","v":"Parks and Rec S7"},121,9,"\"Pie-Mary\"","Greg Daniels","Emma Fletcher & Rachna Fruchbom","2015-02-10",{"$f":"CHOOSE(WEEKDAY(J558),\"Sun\",\"Mon\",\"Tue\",\"Wed\",\"Thu\",\"Fri\",\"Sat\")","v":"Tue"},"20:30:00",null,2.4700000000000002,557,"",{"$f":"VLOOKUP(EpisodeList[[#This Row],[Season Number]], INDIRECT(\"'\" & EpisodeList[[#This Row],[Show]] & \" Season Info'!C2:J15\"), 8,1)","v":"2014-15"}]
["Parks and Rec","Season 7",7,{"$f":"A559& \" S\" &C559","v":"Parks and Rec S7"},122,10,"\"The Johnny Karate Super Awesome Musical Explosion Show\"","Dean Holland","Matt Hubbard","2015-02-17",{"$f":"CHOOSE(WEEKDAY(J559),\"Sun\",\"Mon\",\"Tue\",\"Wed\",\"Thu\",\"Fri\",\"Sat\")","v":"Tue"},"20:00:00",null,2.94,558,"",{"$f":"VLOOKUP(EpisodeList[[#This Row],[Season Number]], INDIRECT(\"'\" & EpisodeList[[#This Row],[Show]] & \" Season Info'!C2:J15\"), 8,1)","v":"2014-15"}]
["Parks and Rec","Season 7",7,{"$f":"A560& \" S\" &C560","v":"Parks and Rec S7"},123,11,"\"Two Funerals\"","Craig Zisk","Jen Statsky","2015-02-17",{"$f":"CHOOSE(WEEKDAY(J560),\"Sun\",\"Mon\",\"Tue\",\"Wed\",\"Thu\",\"Fri\",\"Sat\")","v":"Tue"},"20:30:00",null,2.4700000000000002,559,"",{"$f":"VLOOKUP(EpisodeList[[#This Row],[Season Number]], INDIRECT(\"'\" & EpisodeList[[#This Row],[Show]] & \" Season Info'!C2:J15\"), 8,1)","v":"2014-15"}]
["Parks and Rec","Season 7",7,{"$f":"A561& \" S\" &C561","v":"Parks and Rec S7"},124,12,"\"One Last Ride\"","Michael Schur","Michael Schur & Amy Poehler","2015-02-24",{"$f":"CHOOSE(WEEKDAY(J561),\"Sun\",\"Mon\",\"Tue\",\"Wed\",\"Thu\",\"Fri\",\"Sat\")","v":"Tue"},"20:00:00",null,4.1500000000000004,560,"",{"$f":"VLOOKUP(EpisodeList[[#This Row],[Season Number]], INDIRECT(\"'\" & EpisodeList[[#This Row],[Show]] & \" Season Info'!C2:J15\"), 8,1)","v":"2014-15"}]
["Parks and Rec","Season 7",7,{"$f":"A562& \" S\" &C562","v":"Parks and Rec S7"},125,13,"\"One Last Ride\"","Michael Schur","Michael Schur & Amy Poehler","2015-02-24",{"$f":"CHOOSE(WEEKDAY(J562),\"Sun\",\"Mon\",\"Tue\",\"Wed\",\"Thu\",\"Fri\",\"Sat\")","v":"Tue"},"20:30:00",null,4.1500000000000004,561,"",{"$f":"VLOOKUP(EpisodeList[[#This Row],[Season Number]], INDIRECT(\"'\" & EpisodeList[[#This Row],[Show]] & \" Season Info'!C2:J15\"), 8,1)","v":"2014-15"}]
["Community","Season 6",6,{"$f":"A563& \" S\" &C563","v":"Community S6"},98,1,"\"Ladders\"","Rob Schrab","Dan Harmon & Chris McKenna","2015-03-17",{"$f":"CHOOSE(WEEKDAY(J563),\"Sun\",\"Mon\",\"Tue\",\"Wed\",\"Thu\",\"Fri\",\"Sat\")","v":"Tue"},{"$error":"#VALUE!"},602,null,562,"",{"$f":"VLOOKUP(EpisodeList[[#This Row],[Season Number]], INDIRECT(\"'\" & EpisodeList[[#This Row],[Show]] & \" Season Info'!C2:J15\"), 8,1)","v":"2014-15"}]
["Community","Season 6",6,{"$f":"A564& \" S\" &C564","v":"Community S6"},99,2,"\"Lawnmower Maintenance and Postnatal Care\"","Jim Rash & Nat Faxon","Alex Rubens","2015-03-17",{"$f":"CHOOSE(WEEKDAY(J564),\"Sun\",\"Mon\",\"Tue\",\"Wed\",\"Thu\",\"Fri\",\"Sat\")","v":"Tue"},{"$error":"#VALUE!"},601,null,563,"",{"$f":"VLOOKUP(EpisodeList[[#This Row],[Season Number]], INDIRECT(\"'\" & EpisodeList[[#This Row],[Show]] & \" Season Info'!C2:J15\"), 8,1)","v":"2014-15"}]
["Community","Season 6",6,{"$f":"A565& \" S\" &C565","v":"Community S6"},100,3,"\"Basic Crisis Room Decorum\"","Bobcat Goldthwait","Monica Padrick","2015-03-24",{"$f":"CHOOSE(WEEKDAY(J565),\"Sun\",\"Mon\",\"Tue\",\"Wed\",\"Thu\",\"Fri\",\"Sat\")","v":"Tue"},{"$error":"#VALUE!"},605,null,564,"",{"$f":"VLOOKUP(EpisodeList[[#This Row],[Season Number]], INDIRECT(\"'\" & EpisodeList[[#This Row],[Show]] & \" Season Info'!C2:J15\"), 8,1)","v":"2014-15"}]
["Community","Season 6",6,{"$f":"A566& \" S\" &C566","v":"Community S6"},101,4,"\"Queer Studies and Advanced Waxing\"","Jim Rash & Nat Faxon","Matt Lawton","2015-03-31",{"$f":"CHOOSE(WEEKDAY(J566),\"Sun\",\"Mon\",\"Tue\",\"Wed\",\"Thu\",\"Fri\",\"Sat\")","v":"Tue"},{"$error":"#VALUE!"},603,null,565,"",{"$f":"VLOOKUP(EpisodeList[[#This Row],[Season Number]], INDIRECT(\"'\" & EpisodeList[[#This Row],[Show]] & \" Season Info'!C2:J15\"), 8,1)","v":"2014-15"}]
["Community","Season 6",6,{"$f":"A567& \" S\" &C567","v":"Community S6"},102,5,"\"Laws of Robotics and Party Rights\"","Rob Schrab","Dean Young","2015-04-07",{"$f":"CHOOSE(WEEKDAY(J567),\"Sun\",\"Mon\",\"Tue\",\"Wed\",\"Thu\",\"Fri\",\"Sat\")","v":"Tue"},{"$error":"#VALUE!"},604,null,566,"",{"$f":"VLOOKUP(EpisodeList[[#This Row],[Season Number]], INDIRECT(\"'\" & EpisodeList[[#This Row],[Show]] & \" Season Info'!C2:J15\"), 8,1)","v":"2014-15"}]
["Community","Season 6",6,{"$f":"A568& \" S\" &C568","v":"Community S6"},103,6,"\"Basic Email Security\"","Jay Chandrasekhar","Matt Roller","2015-04-14",{"$f":"CHOOSE(WEEKDAY(J568),\"Sun\",\"Mon\",\"Tue\",\"Wed\",\"Thu\",\"Fri\",\"Sat\")","v":"Tue"},{"$error":"#VALUE!"},606,null,567,"",{"$f":"VLOOKUP(EpisodeList[[#This Row],[Season Number]], INDIRECT(\"'\" & EpisodeList[[#This Row],[Show]] & \" Season Info'!C2:J15\"), 8,1)","v":"2014-15"}]
["Community","Season 6",6,{"$f":"A569& \" S\" &C569","v":"Community S6"},104,7,"\"Advanced Safety Features\"","Rob Schrab","Carol Kolb","2015-04-21",{"$f":"CHOOSE(WEEKDAY(J569),\"Sun\",\"Mon\",\"Tue\",\"Wed\",\"Thu\",\"Fri\",\"Sat\")","v":"Tue"},{"$error":"#VALUE!"},607,null,568,"",{"$f":"VLOOKUP(EpisodeList[[#This Row],[Season Number]], INDIRECT(\"'\" & EpisodeList[[#This Row],[Show]] & \" Season Info'!C2:J15\"), 8,1)","v":"2014-15"}]
["Community","Season 6",6,{"$f":"A570& \" S\" &C570","v":"Community S6"},105,8,"\"Intro to Recycled Cinema\"","Victor Nelli, Jr.","Clay Lapari","2015-04-28",{"$f":"CHOOSE(WEEKDAY(J570),\"Sun\",\"Mon\",\"Tue\",\"Wed\",\"Thu\",\"Fri\",\"Sat\")","v":"Tue"},{"$error":"#VALUE!"},608,null,569,"",{"$f":"VLOOKUP(EpisodeList[[#This Row],[Season Number]], INDIRECT(\"'\" & EpisodeList[[#This Row],[Show]] & \" Season Info'!C2:J15\"), 8,1)","v":"2014-15"}]
["Community","Season 6",6,{"$f":"A571& \" S\" &C571","v":"Community S6"},106,9,"\"Grifting 101\"","Rob Schrab","Ryan Ridley","2015-05-05",{"$f":"CHOOSE(WEEKDAY(J571),\"Sun\",\"Mon\",\"Tue\",\"Wed\",\"Thu\",\"Fri\",\"Sat\")","v":"Tue"},{"$error":"#VALUE!"},609,null,570,"",{"$f":"VLOOKUP(EpisodeList[[#This Row],[Season Number]], INDIRECT(\"'\" & EpisodeList[[#This Row],[Show]] & \" Season Info'!C2:J15\"), 8,1)","v":"2014-15"}]
["Community","Season 6",6,{"$f":"A572& \" S\" &C572","v":"Community S6"},107,10,"\"Basic RV Repair and Palmistry\"","Jay Chandrasekhar","Dan Guterman","2015-05-12",{"$f":"CHOOSE(WEEKDAY(J572),\"Sun\",\"Mon\",\"Tue\",\"Wed\",\"Thu\",\"Fri\",\"Sat\")","v":"Tue"},{"$error":"#VALUE!"},610,null,571,"",{"$f":"VLOOKUP(EpisodeList[[#This Row],[Season Number]], INDIRECT(\"'\" & EpisodeList[[#This Row],[Show]] & \" Season Info'!C2:J15\"), 8,1)","v":"2014-15"}]
["Community","Season 6",6,{"$f":"A573& \" S\" &C573","v":"Community S6"},108,11,"\"Modern Espionage\"","Rob Schrab","Mark Stegemann","2015-05-19",{"$f":"CHOOSE(WEEKDAY(J573),\"Sun\",\"Mon\",\"Tue\",\"Wed\",\"Thu\",\"Fri\",\"Sat\")","v":"Tue"},{"$error":"#VALUE!"},611,null,572,"",{"$f":"VLOOKUP(EpisodeList[[#This Row],[Season Number]], INDIRECT(\"'\" & EpisodeList[[#This Row],[Show]] & \" Season Info'!C2:J15\"), 8,1)","v":"2014-15"}]
["Community","Season 6",6,{"$f":"A574& \" S\" &C574","v":"Community S6"},109,12,"\"Wedding Videography\"","Adam Davidson","Briggs Hatton","2015-05-26",{"$f":"CHOOSE(WEEKDAY(J574),\"Sun\",\"Mon\",\"Tue\",\"Wed\",\"Thu\",\"Fri\",\"Sat\")","v":"Tue"},{"$error":"#VALUE!"},612,null,573,"",{"$f":"VLOOKUP(EpisodeList[[#This Row],[Season Number]], INDIRECT(\"'\" & EpisodeList[[#This Row],[Show]] & \" Season Info'!C2:J15\"), 8,1)","v":"2014-15"}]
["Community","Season 6",6,{"$f":"A575& \" S\" &C575","v":"Community S6"},110,13,"\"Emotional Consequences of Broadcast Television\"","Rob Schrab","Dan Harmon & Chris McKenna","2015-06-02",{"$f":"CHOOSE(WEEKDAY(J575),\"Sun\",\"Mon\",\"Tue\",\"Wed\",\"Thu\",\"Fri\",\"Sat\")","v":"Tue"},{"$error":"#VALUE!"},613,null,574,"",{"$f":"VLOOKUP(EpisodeList[[#This Row],[Season Number]], INDIRECT(\"'\" & EpisodeList[[#This Row],[Show]] & \" Season Info'!C2:J15\"), 8,1)","v":"2014-15"}]

{"sheet":"Color Values","index":2,"n_rows":29,"n_cols":26,"rows_kept":29,"cut":false,"hidden":false,"merged":[[16,2,16,3],[16,16,16,19],[16,20,16,21],[16,22,16,25],[1,0,1,3],[1,14,1,20],[1,21,1,25],[9,14,10,14],[4,16,4,18],[4,21,4,23]]}
["Gradient Tool",null,null,null,null,null,null,null,null,null,null,null,null,null,"Important Note on Macros",null,null,null,null,null,null,"Instructions For Use Without Macros"]
["This tool allows users to generate custom colors for each season of a TV show based on a gradient. After selecting a starting and ending color for each gradient, a custom code will find the HEX codes of user input, and custom formulas will create a gradient between those colors. These colors can then be applied to the \"Episode List\" table.",null,null,null,null,null,null,null,null,null,null,null,null,null,"This is a macro-enabled workbook, meaning it has the ability to run– and be edited by– custom scripts triggered by the buttons \"Generate Gradient\" and \"Apply to Episode List\".\n\nSome users may not have the ability to run macros in their version of Excel, or they may choose not to for security reasons. These users can still use some features of this worksheet– see directions to the right.",null,null,null,null,null,null,"Find your desired starting and ending colors for each gradients. Then, use an online tool to identify the HEX codes and type them manually into C9:D12. The HEX codes for the gradient colors in P9:Z12 will be generated automatically. However, the colors of those cells will not change to match the HEX codes. You can use these HEX codes to manually change cell colors in the \"Episode List\" sheet, if you desire."]
[]
["Instructions"]
["1)","Enter show names in cells A9:A12 (ensure it is spelled identically across all sheets in workbook)","2)","Use bucket tool to set color for first and last season of show.",null,null,null,null,null,null,null,null,null,null,null,"4)","Click \"generate gradient\". This should generate HEX codes for your selected colors and create a gradient of colors for each season of each show.",null,null,null,"5)","If you are happy with your gradient, click \"Apply to Episode List.\" This will color each row in the sheet \"Episode List\" according to its show and season. "]
[]
["Show & Color Input",null,null,null,null,null,null,null,null,null,null,null,null,null,"Color Generation Buttons"]
["TV Show","Number of Seasons\n(Calculated)","Start Gradient\n(First Season)","End Gradient\n(Last Season)","Start Red Value","End Red Value","Red Increment","Start Green Value","End Green Value","Green Increment","Start Blue Value","End Blue Value","Blue increment",null,"Season:",1,2,3,4,5,6,7,8,9,10,11]
["30 Rock",{"$f":"MAX(INDIRECT(\"'\" & 'Color Values'!A9 & \" Season Info'!C:C\"))","v":7},"#FBBACF","#D74F9E",{"$f":"TEXT(HEX2DEC(MID(C9,2,2)), \"00\")","v":"251"},{"$f":"TEXT(HEX2DEC(MID(D9,2,2)), \"00\")","v":"215"},{"$f":"ROUND((F9-E9)/B9,0)","v":-5},{"$f":"TEXT(HEX2DEC(MID(C9,4,2)), \"00\")","v":"186"},{"$f":"TEXT(HEX2DEC(MID(D9,4,2)), \"00\")","v":"79"},{"$f":"ROUND((I9-H9)/B9,0)","v":-15},{"$f":"TEXT(HEX2DEC(MID(C9,6,2)), \"00\")","v":"207"},{"$f":"TEXT(HEX2DEC(MID(D9,6,2)), \"00\")","v":"158"},{"$f":"ROUND((L9-K9)/B9,0)","v":-7},null,null,{"$f":"IF( P$8> $B9, \"\", \"#\" & IF(ISODD(LEN(DEC2HEX($E9+$G9*(P$8-1)))),\"0\",\"\")&DEC2HEX($E9+$G9*(P$8-1))&IF(ISODD(LEN(DEC2HEX($H9+$J9*(P$8-1)))),\"0\",\"\")&DEC2HEX($H9+$J9*(P$8-1))&IF(ISODD(LEN(DEC2HEX($K9+$M9*(P$8-1)))),\"0\",\"\")&DEC2HEX($K9+$M9*(P$8-1)))","v":"#FBBACF"},{"$f":"IF( Q$8> $B9, \"\", \"#\" & IF(ISODD(LEN(DEC2HEX($E9+$G9*(Q$8-1)))),\"0\",\"\")&DEC2HEX($E9+$G9*(Q$8-1))&IF(ISODD(LEN(DEC2HEX($H9+$J9*(Q$8-1)))),\"0\",\"\")&DEC2HEX($H9+$J9*(Q$8-1))&IF(ISODD(LEN(DEC2HEX($K9+$M9*(Q$8-1)))),\"0\",\"\")&DEC2HEX($K9+$M9*(Q$8-1)))","v":"#F6ABC8"},"#F19CC1","#EC8DBA","#E77EB3","#E26FAC","#DD60A5","","","",""]
["The Office",{"$f":"MAX(INDIRECT(\"'\" & 'Color Values'!A10 & \" Season Info'!C:C\"))","v":9},"#F7EBDD","#B5752F",{"$f":"TEXT(HEX2DEC(MID(C10,2,2)), \"00\")","v":"247"},{"$f":"TEXT(HEX2DEC(MID(D10,2,2)), \"00\")","v":"181"},{"$f":"ROUND((F10-E10)/B10,0)","v":-7},{"$f":"TEXT(HEX2DEC(MID(C10,4,2)), \"00\")","v":"235"},{"$f":"TEXT(HEX2DEC(MID(D10,4,2)), \"00\")","v":"117"},{"$f":"ROUND((I10-H10)/B10,0)","v":-13},{"$f":"TEXT(HEX2DEC(MID(C10,6,2)), \"00\")","v":"221"},{"$f":"TEXT(HEX2DEC(MID(D10,6,2)), \"00\")","v":"47"},{"$f":"ROUND((L10-K10)/B10,0)","v":-19},null,"Gradient",{"$f":"IF( P$8> $B10, \"\", \"#\" & IF(ISODD(LEN(DEC2HEX($E10+$G10*(P$8-1)))),\"0\",\"\")&DEC2HEX($E10+$G10*(P$8-1))&IF(ISODD(LEN(DEC2HEX($H10+$J10*(P$8-1)))),\"0\",\"\")&DEC2HEX($H10+$J10*(P$8-1))&IF(ISODD(LEN(DEC2HEX($K10+$M10*(P$8-1)))),\"0\",\"\")&DEC2HEX($K10+$M10*(P$8-1)))","v":"#F7EBDD"},"#F0DECA","#E9D1B7","#E2C4A4","#DBB791","#D4AA7E","#CD9D6B","#C69058","#BF8345","",""]
["Parks and Rec",{"$f":"MAX(INDIRECT(\"'\" & 'Color Values'!A11 & \" Season Info'!C:C\"))","v":7},"#DAEFE2","#358254","218","53",-24,"239","130",-16,"226","84",-20,null,null,"#DAEFE2","#C2DFCE","#AACFBA","#92BFA6","#7AAF92","#629F7E","#4A8F6A","","","",""]
["Community",{"$f":"MAX(INDIRECT(\"'\" & 'Color Values'!A12 & \" Season Info'!C:C\"))","v":6},"#D6E4FC","#1159C6","214",{"$f":"TEXT(HEX2DEC(MID(D12,2,2)), \"00\")","v":"17"},{"$f":"ROUND((F12-E12)/B12,0)","v":-33},"228",{"$f":"TEXT(HEX2DEC(MID(D12,4,2)), \"00\")","v":"89"},{"$f":"ROUND((I12-H12)/B12,0)","v":-23},"252",{"$f":"TEXT(HEX2DEC(MID(D12,6,2)), \"00\")","v":"198"},{"$f":"ROUND((L12-K12)/B12,0)","v":-9},null,null,"#D6E4FC","#B5CDF3","#94B6EA","#739FE1","#5288D8","#3171CF","","","","",""]
[]
[null,null,null,"Unhide to see helper columns -->",null,null,null,null,null,null,null,null,null,"<--"]
["Descriptions & Explanations:"]
["Functions Used:","INDIRECT & MAX","VBA Macro",null,"TEXT, HEX2DEC, MID, ROUND",null,null,null,null,null,null,null,null,null,null,null,"IF, ISODD, DEC2HEX, LEN"]
[null,"Finds the max value in column C of the sheet \"[Show] Season Info\"","Once \"Generate Gradient\" button is pushed, VBA Macro FindHEXCode() will find the HEX Codes for the background colors of cells in the range C9:D12 and print them in their respective cells.",null,"Takes first two digits of HEX code in column C and converts to RGB value","Takes first two digits of HEX code in column D and converts to RGB value","Divides (End Red Value - Start Red Value) by the number of seasons and rounds to nearest integer. This will give us equally-spaced red values for each season of the show.","Repeats process for red values but uses second two digits of HEX code (green values)",null,null,"Repeats process for red values but last second two digits of HEX code (blue values)",null,null,null,null,"If Working correctly, the first season (column P) should match column C.","A formula** in each box takes the starting Red, Green, and Blue values (which are found by formulas in the hidden \"helper cells\" after the HEX Codes in cells C9:D12 are found by the FindHexCode() macro). Each season, the values are increased/decreased by their respective \"Increment Value\" (found in columns G, J, and M). The resulting BGR* code is then converted to a HEX Code, which you will see displayed in the cell. Leaves the cell blank if the show does not have more seasons.\n\n*Excel uses BGR instead of RGB\n**Formula based on this tutorial: https://code.adonline.id.au/rgb-to-hex-in-excel/",null,null,null,"Once \"Generate Gradient\" button is pushed, VBA Macro \"Print Gradient\" will find the HEX codes printed in cells P9:Z12 and change their background colors to match those HEX codes.",null,"When \"Apply to Episode List\" button is pressed, VBA Macro \"ApplyEpisodeColors\" will run. This macro matches the TV show and season for every row in the \"Episode List\" sheet to the background color in the table above. Then, it changes the background color of all cells in that row to the correct background color. The show title (column A) will always be the same as the \"End Gradient\" color, regardless of season. THis macro does not override the conditional formatting used in the \"Epsode List\" sheet."]
[]
[]
[]
[]
[null,"Excel uses BGR instead of RBG"]
[]
["Future Additons:","Consider making formulas dynamic array formulas: https://www.youtube.com/watch?v=Cfpxxx2MIcI"]
[null,"Color Episode List Based on Gradient"]
[null,"Color Season Info based on gradient"]
[]
[]
["If you do not have access to the macro, you can manually type in the hex codes. Make sure they start with a #"]

{"sheet":"Graphs","index":3,"n_rows":286,"n_cols":35,"rows_kept":286,"cut":false,"hidden":false,"merged":[[3,14,3,22]]}
[]
[]
[]
[null,null,null,null,null,null,null,null,null,null,null,null,null,null,"Percent of Total Viewership Per TV  Season\n(only nights with all 4 shows were considered)"]
[]
[]
[]
[]
[]
["Pivot Tables","Tables and source data are color-coded for conveinence.",null,null,null,null,null,null,null,null,null,null,null,null,null,null,null,null,null,null,"XLOOKUP Table"]
[]
["U.S. Viewership by Date",null,null,null,null,null,null,"U.S. Viewership by Season & Episode Number",null,null,null,null,null,null,"U.S. Viewership by Show",null,null,null,null,null,null,"Season Ranking by year/season"]
[]
[null,null,null,null,null,null,null,null,null,null,null,null,null,null,"Full Lineup?","Yes",null,null,null,null,null,null,"30 Rock",null,null,"The Office",null,null,"Parks and Rec",null,null,"Community"]
[null,null,null,null,null,null,null,null,null,null,null,null,null,null,null,null,null,null,null,null,null,"TV Season","Season","Avg. Viewers","Rank","Season","Avg. Viewers","Rank","Season","Avg. Viewers","Rank","Season","Avg. Viewers","Rank","Sum of Viewers"]
["Sum of U.S. viewers(millions)","Column Labels",null,null,null,null,null,"Sum of U.S. viewers(millions)","Column Labels",null,null,null,null,null,"Sum of U.S. viewers(millions)","Column Labels",null,null,null,null,null,"2004-05",{"$f":"_xlfn.XLOOKUP($V16, INDIRECT(\"'\" & W$14 & \" Season Info'!J2:J15\"), INDIRECT(\"'\" & W$14 & \" Season Info'!C2:C15\"), \"\",  0, 1)","v":""},{"$f":"_xlfn.XLOOKUP($V16, INDIRECT(\"'\" & W$14 & \" Season Info'!J2:J15\"), INDIRECT(\"'\" & W$14 & \" Season Info'!L2:L15\"), \"\",  0, 1)","v":""},{"$f":"IF(_xlfn.XLOOKUP($V16, INDIRECT(\"'\" & W$14 & \" Season Info'!J2:J15\"), INDIRECT(\"'\" & W$14 & \" Season Info'!K2:K15\"), \"\",  0, 1)=\"\", NA(), _xlfn.XLOOKUP($V16, INDIRECT(\"'\" & W$14 & \" Season Info'!J2:J15\"), INDIRECT(\"'\" & W$14 & \" Season Info'!K2:K15\"), \"\",  0, 1))","v":{"$error":"#N/A"}},{"$f":"_xlfn.XLOOKUP($V16, INDIRECT(\"'\" & Z$14 & \" Season Info'!J2:J15\"), INDIRECT(\"'\" & Z$14 & \" Season Info'!C2:C15\"), \"\",  0, 1)","v":1},{"$f":"_xlfn.XLOOKUP($V16, INDIRECT(\"'\" & Z$14 & \" Season Info'!J2:J15\"), INDIRECT(\"'\" & Z$14 & \" Season Info'!L2:L15\"), \"\",  0, 1)","v":5.4},{"$f":"IF(_xlfn.XLOOKUP($V16, INDIRECT(\"'\" & Z$14 & \" Season Info'!J2:J15\"), INDIRECT(\"'\" & Z$14 & \" Season Info'!K2:K15\"), \"\",  0, 1)=\"\", NA(), _xlfn.XLOOKUP($V16, INDIRECT(\"'\" & Z$14 & \" Season Info'!J2:J15\"), INDIRECT(\"'\" & Z$14 & \" Season Info'!K2:K15\"), \"\",  0, 1))","v":102},{"$f":"_xlfn.XLOOKUP($V16, INDIRECT(\"'\" & AC$14 & \" Season Info'!J2:J15\"), INDIRECT(\"'\" & AC$14 & \" Season Info'!C2:C15\"), \"\",  0, 1)","v":""},{"$f":"_xlfn.XLOOKUP($V16, INDIRECT(\"'\" & AC$14 & \" Season Info'!J2:J15\"), INDIRECT(\"'\" & AC$14 & \" Season Info'!L2:L15\"), \"\",  0, 1)","v":""},{"$f":"IF(_xlfn.XLOOKUP($V16, INDIRECT(\"'\" & AC$14 & \" Season Info'!J2:J15\"), INDIRECT(\"'\" & AC$14 & \" Season Info'!K2:K15\"), \"\",  0, 1)=\"\", NA(), _xlfn.XLOOKUP($V16, INDIRECT(\"'\" & AC$14 & \" Season Info'!J2:J15\"), INDIRECT(\"'\" & AC$14 & \" Season Info'!K2:K15\"), \"\",  0, 1))","v":{"$error":"#N/A"}},{"$f":"_xlfn.XLOOKUP($V16, INDIRECT(\"'\" & AF$14 & \" Season Info'!J2:J15\"), INDIRECT(\"'\" & AF$14 & \" Season Info'!C2:C15\"), \"\",  0, 1)","v":""},{"$f":"_xlfn.XLOOKUP($V16, INDIRECT(\"'\" & AF$14 & \" Season Info'!J2:J15\"), INDIRECT(\"'\" & AF$14 & \" Season Info'!L2:L15\"), \"\",  0, 1)","v":""},{"$f":"IF(_xlfn.XLOOKUP($V16, INDIRECT(\"'\" & AF$14 & \" Season Info'!J2:J15\"), INDIRECT(\"'\" & AF$14 & \" Season Info'!K2:K15\"), \"\",  0, 1)=\"\", NA(), _xlfn.XLOOKUP($V16, INDIRECT(\"'\" & AF$14 & \" Season Info'!J2:J15\"), INDIRECT(\"'\" & AF$14 & \" Season Info'!K2:K15\"), \"\",  0, 1))","v":{"$error":"#N/A"}},{"$f":"SUM(X16,AA16,AD16,AG16)","v":5.4}]
["Row Labels","30 Rock","Community","Parks and Rec","The Office","Grand Total",null,"Row Labels","30 Rock","Community","Parks and Rec","The Office","Grand Total",null,"Row Labels","2009-10","2010-11","2011-12","Grand Total",null,null,"2005-06",{"$f":"_xlfn.XLOOKUP($V17, INDIRECT(\"'\" & W$14 & \" Season Info'!J2:J15\"), INDIRECT(\"'\" & W$14 & \" Season Info'!C2:C15\"), \"\",  0, 1)","v":""},{"$f":"_xlfn.XLOOKUP($V17, INDIRECT(\"'\" & W$14 & \" Season Info'!J2:J15\"), INDIRECT(\"'\" & W$14 & \" Season Info'!L2:L15\"), \"\",  0, 1)","v":""},{"$f":"IF(_xlfn.XLOOKUP($V17, INDIRECT(\"'\" & W$14 & \" Season Info'!J2:J15\"), INDIRECT(\"'\" & W$14 & \" Season Info'!K2:K15\"), \"\",  0, 1)=\"\", NA(), _xlfn.XLOOKUP($V17, INDIRECT(\"'\" & W$14 & \" Season Info'!J2:J15\"), INDIRECT(\"'\" & W$14 & \" Season Info'!K2:K15\"), \"\",  0, 1))","v":{"$error":"#N/A"}},{"$f":"_xlfn.XLOOKUP($V17, INDIRECT(\"'\" & Z$14 & \" Season Info'!J2:J15\"), INDIRECT(\"'\" & Z$14 & \" Season Info'!C2:C15\"), \"\",  0, 1)","v":2},{"$f":"_xlfn.XLOOKUP($V17, INDIRECT(\"'\" & Z$14 & \" Season Info'!J2:J15\"), INDIRECT(\"'\" & Z$14 & \" Season Info'!L2:L15\"), \"\",  0, 1)","v":8},{"$f":"IF(_xlfn.XLOOKUP($V17, INDIRECT(\"'\" & Z$14 & \" Season Info'!J2:J15\"), INDIRECT(\"'\" & Z$14 & \" Season Info'!K2:K15\"), \"\",  0, 1)=\"\", NA(), _xlfn.XLOOKUP($V17, INDIRECT(\"'\" & Z$14 & \" Season Info'!J2:J15\"), INDIRECT(\"'\" & Z$14 & \" Season Info'!K2:K15\"), \"\",  0, 1))","v":67},{"$f":"_xlfn.XLOOKUP($V17, INDIRECT(\"'\" & AC$14 & \" Season Info'!J2:J15\"), INDIRECT(\"'\" & AC$14 & \" Season Info'!C2:C15\"), \"\",  0, 1)","v":""},{"$f":"_xlfn.XLOOKUP($V17, INDIRECT(\"'\" & AC$14 & \" Season Info'!J2:J15\"), INDIRECT(\"'\" & AC$14 & \" Season Info'!L2:L15\"), \"\",  0, 1)","v":""},{"$f":"IF(_xlfn.XLOOKUP($V17, INDIRECT(\"'\" & AC$14 & \" Season Info'!J2:J15\"), INDIRECT(\"'\" & AC$14 & \" Season Info'!K2:K15\"), \"\",  0, 1)=\"\", NA(), _xlfn.XLOOKUP($V17, INDIRECT(\"'\" & AC$14 & \" Season Info'!J2:J15\"), INDIRECT(\"'\" & AC$14 & \" Season Info'!K2:K15\"), \"\",  0, 1))","v":{"$error":"#N/A"}},{"$f":"_xlfn.XLOOKUP($V17, INDIRECT(\"'\" & AF$14 & \" Season Info'!J2:J15\"), INDIRECT(\"'\" & AF$14 & \" Season Info'!C2:C15\"), \"\",  0, 1)","v":""},{"$f":"_xlfn.XLOOKUP($V17, INDIRECT(\"'\" & AF$14 & \" Season Info'!J2:J15\"), INDIRECT(\"'\" & AF$14 & \" Season Info'!L2:L15\"), \"\",  0, 1)","v":""},{"$f":"IF(_xlfn.XLOOKUP($V17, INDIRECT(\"'\" & AF$14 & \" Season Info'!J2:J15\"), INDIRECT(\"'\" & AF$14 & \" Season Info'!K2:K15\"), \"\",  0, 1)=\"\", NA(), _xlfn.XLOOKUP($V17, INDIRECT(\"'\" & AF$14 & \" Season Info'!J2:J15\"), INDIRECT(\"'\" & AF$14 & \" Season Info'!K2:K15\"), \"\",  0, 1))","v":{"$error":"#N/A"}},{"$f":"SUM(X17,AA17,AD17,AG17)","v":8}]
["2005",null,null,null,119.42999999999999,119.42999999999999,null,"Season 1",117.1,127.7,32.11,38.199999999999996,315.11000000000007,null,"30 Rock",107.3,45.81,12.49,165.60000000000002,null,null,"2006-07",{"$f":"_xlfn.XLOOKUP($V18, INDIRECT(\"'\" & W$14 & \" Season Info'!J2:J15\"), INDIRECT(\"'\" & W$14 & \" Season Info'!C2:C15\"), \"\",  0, 1)","v":1},{"$f":"_xlfn.XLOOKUP($V18, INDIRECT(\"'\" & W$14 & \" Season Info'!J2:J15\"), INDIRECT(\"'\" & W$14 & \" Season Info'!L2:L15\"), \"\",  0, 1)","v":5.8},{"$f":"IF(_xlfn.XLOOKUP($V18, INDIRECT(\"'\" & W$14 & \" Season Info'!J2:J15\"), INDIRECT(\"'\" & W$14 & \" Season Info'!K2:K15\"), \"\",  0, 1)=\"\", NA(), _xlfn.XLOOKUP($V18, INDIRECT(\"'\" & W$14 & \" Season Info'!J2:J15\"), INDIRECT(\"'\" & W$14 & \" Season Info'!K2:K15\"), \"\",  0, 1))","v":102},{"$f":"_xlfn.XLOOKUP($V18, INDIRECT(\"'\" & Z$14 & \" Season Info'!J2:J15\"), INDIRECT(\"'\" & Z$14 & \" Season Info'!C2:C15\"), \"\",  0, 1)","v":3},{"$f":"_xlfn.XLOOKUP($V18, INDIRECT(\"'\" & Z$14 & \" Season Info'!J2:J15\"), INDIRECT(\"'\" & Z$14 & \" Season Info'!L2:L15\"), \"\",  0, 1)","v":8.3000000000000007},{"$f":"IF(_xlfn.XLOOKUP($V18, INDIRECT(\"'\" & Z$14 & \" Season Info'!J2:J15\"), INDIRECT(\"'\" & Z$14 & \" Season Info'!K2:K15\"), \"\",  0, 1)=\"\", NA(), _xlfn.XLOOKUP($V18, INDIRECT(\"'\" & Z$14 & \" Season Info'!J2:J15\"), INDIRECT(\"'\" & Z$14 & \" Season Info'!K2:K15\"), \"\",  0, 1))","v":68},{"$f":"_xlfn.XLOOKUP($V18, INDIRECT(\"'\" & AC$14 & \" Season Info'!J2:J15\"), INDIRECT(\"'\" & AC$14 & \" Season Info'!C2:C15\"), \"\",  0, 1)","v":""},{"$f":"_xlfn.XLOOKUP($V18, INDIRECT(\"'\" & AC$14 & \" Season Info'!J2:J15\"), INDIRECT(\"'\" & AC$14 & \" Season Info'!L2:L15\"), \"\",  0, 1)","v":""},{"$f":"IF(_xlfn.XLOOKUP($V18, INDIRECT(\"'\" & AC$14 & \" Season Info'!J2:J15\"), INDIRECT(\"'\" & AC$14 & \" Season Info'!K2:K15\"), \"\",  0, 1)=\"\", NA(), _xlfn.XLOOKUP($V18, INDIRECT(\"'\" & AC$14 & \" Season Info'!J2:J15\"), INDIRECT(\"'\" & AC$14 & \" Season Info'!K2:K15\"), \"\",  0, 1))","v":{"$error":"#N/A"}},{"$f":"_xlfn.XLOOKUP($V18, INDIRECT(\"'\" & AF$14 & \" Season Info'!J2:J15\"), INDIRECT(\"'\" & AF$14 & \" Season Info'!C2:C15\"), \"\",  0, 1)","v":""},{"$f":"_xlfn.XLOOKUP($V18, INDIRECT(\"'\" & AF$14 & \" Season Info'!J2:J15\"), INDIRECT(\"'\" & AF$14 & \" Season Info'!L2:L15\"), \"\",  0, 1)","v":""},{"$f":"IF(_xlfn.XLOOKUP($V18, INDIRECT(\"'\" & AF$14 & \" Season Info'!J2:J15\"), INDIRECT(\"'\" & AF$14 & \" Season Info'!K2:K15\"), \"\",  0, 1)=\"\", NA(), _xlfn.XLOOKUP($V18, INDIRECT(\"'\" & AF$14 & \" Season Info'!J2:J15\"), INDIRECT(\"'\" & AF$14 & \" Season Info'!K2:K15\"), \"\",  0, 1))","v":{"$error":"#N/A"}},14.100000000000001]
["2005-03-24",null,null,null,11.2,11.2,null,1,8.1,7.89,6.77,11.2,33.959999999999994,null,"Community",89.54,40.010000000000005,12.17,141.72,null,null,"2007-08",{"$f":"_xlfn.XLOOKUP($V19, INDIRECT(\"'\" & W$14 & \" Season Info'!J2:J15\"), INDIRECT(\"'\" & W$14 & \" Season Info'!C2:C15\"), \"\",  0, 1)","v":2},{"$f":"_xlfn.XLOOKUP($V19, INDIRECT(\"'\" & W$14 & \" Season Info'!J2:J15\"), INDIRECT(\"'\" & W$14 & \" Season Info'!L2:L15\"), \"\",  0, 1)","v":6.5},{"$f":"IF(_xlfn.XLOOKUP($V19, INDIRECT(\"'\" & W$14 & \" Season Info'!J2:J15\"), INDIRECT(\"'\" & W$14 & \" Season Info'!K2:K15\"), \"\",  0, 1)=\"\", NA(), _xlfn.XLOOKUP($V19, INDIRECT(\"'\" & W$14 & \" Season Info'!J2:J15\"), INDIRECT(\"'\" & W$14 & \" Season Info'!K2:K15\"), \"\",  0, 1))","v":111},{"$f":"_xlfn.XLOOKUP($V19, INDIRECT(\"'\" & Z$14 & \" Season Info'!J2:J15\"), INDIRECT(\"'\" & Z$14 & \" Season Info'!C2:C15\"), \"\",  0, 1)","v":4},{"$f":"_xlfn.XLOOKUP($V19, INDIRECT(\"'\" & Z$14 & \" Season Info'!J2:J15\"), INDIRECT(\"'\" & Z$14 & \" Season Info'!L2:L15\"), \"\",  0, 1)","v":8.0399999999999991},{"$f":"IF(_xlfn.XLOOKUP($V19, INDIRECT(\"'\" & Z$14 & \" Season Info'!J2:J15\"), INDIRECT(\"'\" & Z$14 & \" Season Info'!K2:K15\"), \"\",  0, 1)=\"\", NA(), _xlfn.XLOOKUP($V19, INDIRECT(\"'\" & Z$14 & \" Season Info'!J2:J15\"), INDIRECT(\"'\" & Z$14 & \" Season Info'!K2:K15\"), \"\",  0, 1))","v":77},{"$f":"_xlfn.XLOOKUP($V19, INDIRECT(\"'\" & AC$14 & \" Season Info'!J2:J15\"), INDIRECT(\"'\" & AC$14 & \" Season Info'!C2:C15\"), \"\",  0, 1)","v":""},{"$f":"_xlfn.XLOOKUP($V19, INDIRECT(\"'\" & AC$14 & \" Season Info'!J2:J15\"), INDIRECT(\"'\" & AC$14 & \" Season Info'!L2:L15\"), \"\",  0, 1)","v":""},{"$f":"IF(_xlfn.XLOOKUP($V19, INDIRECT(\"'\" & AC$14 & \" Season Info'!J2:J15\"), INDIRECT(\"'\" & AC$14 & \" Season Info'!K2:K15\"), \"\",  0, 1)=\"\", NA(), _xlfn.XLOOKUP($V19, INDIRECT(\"'\" & AC$14 & \" Season Info'!J2:J15\"), INDIRECT(\"'\" & AC$14 & \" Season Info'!K2:K15\"), \"\",  0, 1))","v":{"$error":"#N/A"}},{"$f":"_xlfn.XLOOKUP($V19, INDIRECT(\"'\" & AF$14 & \" Season Info'!J2:J15\"), INDIRECT(\"'\" & AF$14 & \" Season Info'!C2:C15\"), \"\",  0, 1)","v":""},{"$f":"_xlfn.XLOOKUP($V19, INDIRECT(\"'\" & AF$14 & \" Season Info'!J2:J15\"), INDIRECT(\"'\" & AF$14 & \" Season Info'!L2:L15\"), \"\",  0, 1)","v":""},{"$f":"IF(_xlfn.XLOOKUP($V19, INDIRECT(\"'\" & AF$14 & \" Season Info'!J2:J15\"), INDIRECT(\"'\" & AF$14 & \" Season Info'!K2:K15\"), \"\",  0, 1)=\"\", NA(), _xlfn.XLOOKUP($V19, INDIRECT(\"'\" & AF$14 & \" Season Info'!J2:J15\"), INDIRECT(\"'\" & AF$14 & \" Season Info'!K2:K15\"), \"\",  0, 1))","v":{"$error":"#N/A"}},14.54]
["2005-03-29",null,null,null,6,6,null,2,5.7,5.39,5.92,6,23.009999999999998,null,"Parks and Rec",83.47,51.120000000000005,13.309999999999999,147.9,null,null,"2008-09",{"$f":"_xlfn.XLOOKUP($V20, INDIRECT(\"'\" & W$14 & \" Season Info'!J2:J15\"), INDIRECT(\"'\" & W$14 & \" Season Info'!C2:C15\"), \"\",  0, 1)","v":3},{"$f":"_xlfn.XLOOKUP($V20, INDIRECT(\"'\" & W$14 & \" Season Info'!J2:J15\"), INDIRECT(\"'\" & W$14 & \" Season Info'!L2:L15\"), \"\",  0, 1)","v":7.5},{"$f":"IF(_xlfn.XLOOKUP($V20, INDIRECT(\"'\" & W$14 & \" Season Info'!J2:J15\"), INDIRECT(\"'\" & W$14 & \" Season Info'!K2:K15\"), \"\",  0, 1)=\"\", NA(), _xlfn.XLOOKUP($V20, INDIRECT(\"'\" & W$14 & \" Season Info'!J2:J15\"), INDIRECT(\"'\" & W$14 & \" Season Info'!K2:K15\"), \"\",  0, 1))","v":69},{"$f":"_xlfn.XLOOKUP($V20, INDIRECT(\"'\" & Z$14 & \" Season Info'!J2:J15\"), INDIRECT(\"'\" & Z$14 & \" Season Info'!C2:C15\"), \"\",  0, 1)","v":5},{"$f":"_xlfn.XLOOKUP($V20, INDIRECT(\"'\" & Z$14 & \" Season Info'!J2:J15\"), INDIRECT(\"'\" & Z$14 & \" Season Info'!L2:L15\"), \"\",  0, 1)","v":9.0399999999999991},{"$f":"IF(_xlfn.XLOOKUP($V20, INDIRECT(\"'\" & Z$14 & \" Season Info'!J2:J15\"), INDIRECT(\"'\" & Z$14 & \" Season Info'!K2:K15\"), \"\",  0, 1)=\"\", NA(), _xlfn.XLOOKUP($V20, INDIRECT(\"'\" & Z$14 & \" Season Info'!J2:J15\"), INDIRECT(\"'\" & Z$14 & \" Season Info'!K2:K15\"), \"\",  0, 1))","v":52},{"$f":"_xlfn.XLOOKUP($V20, INDIRECT(\"'\" & AC$14 & \" Season Info'!J2:J15\"), INDIRECT(\"'\" & AC$14 & \" Season Info'!C2:C15\"), \"\",  0, 1)","v":1},{"$f":"_xlfn.XLOOKUP($V20, INDIRECT(\"'\" & AC$14 & \" Season Info'!J2:J15\"), INDIRECT(\"'\" & AC$14 & \" Season Info'!L2:L15\"), \"\",  0, 1)","v":6},{"$f":"IF(_xlfn.XLOOKUP($V20, INDIRECT(\"'\" & AC$14 & \" Season Info'!J2:J15\"), INDIRECT(\"'\" & AC$14 & \" Season Info'!K2:K15\"), \"\",  0, 1)=\"\", NA(), _xlfn.XLOOKUP($V20, INDIRECT(\"'\" & AC$14 & \" Season Info'!J2:J15\"), INDIRECT(\"'\" & AC$14 & \" Season Info'!K2:K15\"), \"\",  0, 1))","v":96},{"$f":"_xlfn.XLOOKUP($V20, INDIRECT(\"'\" & AF$14 & \" Season Info'!J2:J15\"), INDIRECT(\"'\" & AF$14 & \" Season Info'!C2:C15\"), \"\",  0, 1)","v":""},{"$f":"_xlfn.XLOOKUP($V20, INDIRECT(\"'\" & AF$14 & \" Season Info'!J2:J15\"), INDIRECT(\"'\" & AF$14 & \" Season Info'!L2:L15\"), \"\",  0, 1)","v":""},{"$f":"IF(_xlfn.XLOOKUP($V20, INDIRECT(\"'\" & AF$14 & \" Season Info'!J2:J15\"), INDIRECT(\"'\" & AF$14 & \" Season Info'!K2:K15\"), \"\",  0, 1)=\"\", NA(), _xlfn.XLOOKUP($V20, INDIRECT(\"'\" & AF$14 & \" Season Info'!J2:J15\"), INDIRECT(\"'\" & AF$14 & \" Season Info'!K2:K15\"), \"\",  0, 1))","v":{"$error":"#N/A"}},22.54]
["2005-04-05",null,null,null,5.8,5.8,null,3,6,5.86,5.24,5.8,22.900000000000002,null,"The Office",135.97000000000003,71.599999999999994,17.45,225.02,null,null,"2009-10",{"$f":"_xlfn.XLOOKUP($V21, INDIRECT(\"'\" & W$14 & \" Season Info'!J2:J15\"), INDIRECT(\"'\" & W$14 & \" Season Info'!C2:C15\"), \"\",  0, 1)","v":4},{"$f":"_xlfn.XLOOKUP($V21, INDIRECT(\"'\" & W$14 & \" Season Info'!J2:J15\"), INDIRECT(\"'\" & W$14 & \" Season Info'!L2:L15\"), \"\",  0, 1)","v":5.9},{"$f":"IF(_xlfn.XLOOKUP($V21, INDIRECT(\"'\" & W$14 & \" Season Info'!J2:J15\"), INDIRECT(\"'\" & W$14 & \" Season Info'!K2:K15\"), \"\",  0, 1)=\"\", NA(), _xlfn.XLOOKUP($V21, INDIRECT(\"'\" & W$14 & \" Season Info'!J2:J15\"), INDIRECT(\"'\" & W$14 & \" Season Info'!K2:K15\"), \"\",  0, 1))","v":86},{"$f":"_xlfn.XLOOKUP($V21, INDIRECT(\"'\" & Z$14 & \" Season Info'!J2:J15\"), INDIRECT(\"'\" & Z$14 & \" Season Info'!C2:C15\"), \"\",  0, 1)","v":6},{"$f":"_xlfn.XLOOKUP($V21, INDIRECT(\"'\" & Z$14 & \" Season Info'!J2:J15\"), INDIRECT(\"'\" & Z$14 & \" Season Info'!L2:L15\"), \"\",  0, 1)","v":8.73},{"$f":"IF(_xlfn.XLOOKUP($V21, INDIRECT(\"'\" & Z$14 & \" Season Info'!J2:J15\"), INDIRECT(\"'\" & Z$14 & \" Season Info'!K2:K15\"), \"\",  0, 1)=\"\", NA(), _xlfn.XLOOKUP($V21, INDIRECT(\"'\" & Z$14 & \" Season Info'!J2:J15\"), INDIRECT(\"'\" & Z$14 & \" Season Info'!K2:K15\"), \"\",  0, 1))","v":41},{"$f":"_xlfn.XLOOKUP($V21, INDIRECT(\"'\" & AC$14 & \" Season Info'!J2:J15\"), INDIRECT(\"'\" & AC$14 & \" Season Info'!C2:C15\"), \"\",  0, 1)","v":2},{"$f":"_xlfn.XLOOKUP($V21, INDIRECT(\"'\" & AC$14 & \" Season Info'!J2:J15\"), INDIRECT(\"'\" & AC$14 & \" Season Info'!L2:L15\"), \"\",  0, 1)","v":4.5999999999999996},{"$f":"IF(_xlfn.XLOOKUP($V21, INDIRECT(\"'\" & AC$14 & \" Season Info'!J2:J15\"), INDIRECT(\"'\" & AC$14 & \" Season Info'!K2:K15\"), \"\",  0, 1)=\"\", NA(), _xlfn.XLOOKUP($V21, INDIRECT(\"'\" & AC$14 & \" Season Info'!J2:J15\"), INDIRECT(\"'\" & AC$14 & \" Season Info'!K2:K15\"), \"\",  0, 1))","v":108},{"$f":"_xlfn.XLOOKUP($V21, INDIRECT(\"'\" & AF$14 & \" Season Info'!J2:J15\"), INDIRECT(\"'\" & AF$14 & \" Season Info'!C2:C15\"), \"\",  0, 1)","v":1},{"$f":"_xlfn.XLOOKUP($V21, INDIRECT(\"'\" & AF$14 & \" Season Info'!J2:J15\"), INDIRECT(\"'\" & AF$14 & \" Season Info'!L2:L15\"), \"\",  0, 1)","v":5},{"$f":"IF(_xlfn.XLOOKUP($V21, INDIRECT(\"'\" & AF$14 & \" Season Info'!J2:J15\"), INDIRECT(\"'\" & AF$14 & \" Season Info'!K2:K15\"), \"\",  0, 1)=\"\", NA(), _xlfn.XLOOKUP($V21, INDIRECT(\"'\" & AF$14 & \" Season Info'!J2:J15\"), INDIRECT(\"'\" & AF$14 & \" Season Info'!K2:K15\"), \"\",  0, 1))","v":97},24.23]
["2005-04-12",null,null,null,5.4,5.4,null,4,4.5999999999999996,4.87,5.29,5.4,20.159999999999997,null,"Grand Total",416.28000000000003,208.54,55.42,680.24,null,null,"2010-11",{"$f":"_xlfn.XLOOKUP($V22, INDIRECT(\"'\" & W$14 & \" Season Info'!J2:J15\"), INDIRECT(\"'\" & W$14 & \" Season Info'!C2:C15\"), \"\",  0, 1)","v":5},{"$f":"_xlfn.XLOOKUP($V22, INDIRECT(\"'\" & W$14 & \" Season Info'!J2:J15\"), INDIRECT(\"'\" & W$14 & \" Season Info'!L2:L15\"), \"\",  0, 1)","v":5.3},{"$f":"IF(_xlfn.XLOOKUP($V22, INDIRECT(\"'\" & W$14 & \" Season Info'!J2:J15\"), INDIRECT(\"'\" & W$14 & \" Season Info'!K2:K15\"), \"\",  0, 1)=\"\", NA(), _xlfn.XLOOKUP($V22, INDIRECT(\"'\" & W$14 & \" Season Info'!J2:J15\"), INDIRECT(\"'\" & W$14 & \" Season Info'!K2:K15\"), \"\",  0, 1))","v":106},{"$f":"_xlfn.XLOOKUP($V22, INDIRECT(\"'\" & Z$14 & \" Season Info'!J2:J15\"), INDIRECT(\"'\" & Z$14 & \" Season Info'!C2:C15\"), \"\",  0, 1)","v":7},{"$f":"_xlfn.XLOOKUP($V22, INDIRECT(\"'\" & Z$14 & \" Season Info'!J2:J15\"), INDIRECT(\"'\" & Z$14 & \" Season Info'!L2:L15\"), \"\",  0, 1)","v":7.73},{"$f":"IF(_xlfn.XLOOKUP($V22, INDIRECT(\"'\" & Z$14 & \" Season Info'!J2:J15\"), INDIRECT(\"'\" & Z$14 & \" Season Info'!K2:K15\"), \"\",  0, 1)=\"\", NA(), _xlfn.XLOOKUP($V22, INDIRECT(\"'\" & Z$14 & \" Season Info'!J2:J15\"), INDIRECT(\"'\" & Z$14 & \" Season Info'!K2:K15\"), \"\",  0, 1))","v":53},{"$f":"_xlfn.XLOOKUP($V22, INDIRECT(\"'\" & AC$14 & \" Season Info'!J2:J15\"), INDIRECT(\"'\" & AC$14 & \" Season Info'!C2:C15\"), \"\",  0, 1)","v":3},{"$f":"_xlfn.XLOOKUP($V22, INDIRECT(\"'\" & AC$14 & \" Season Info'!J2:J15\"), INDIRECT(\"'\" & AC$14 & \" Season Info'!L2:L15\"), \"\",  0, 1)","v":5.0999999999999996},{"$f":"IF(_xlfn.XLOOKUP($V22, INDIRECT(\"'\" & AC$14 & \" Season Info'!J2:J15\"), INDIRECT(\"'\" & AC$14 & \" Season Info'!K2:K15\"), \"\",  0, 1)=\"\", NA(), _xlfn.XLOOKUP($V22, INDIRECT(\"'\" & AC$14 & \" Season Info'!J2:J15\"), INDIRECT(\"'\" & AC$14 & \" Season Info'!K2:K15\"), \"\",  0, 1))","v":116},{"$f":"_xlfn.XLOOKUP($V22, INDIRECT(\"'\" & AF$14 & \" Season Info'!J2:J15\"), INDIRECT(\"'\" & AF$14 & \" Season Info'!C2:C15\"), \"\",  0, 1)","v":2},{"$f":"_xlfn.XLOOKUP($V22, INDIRECT(\"'\" & AF$14 & \" Season Info'!J2:J15\"), INDIRECT(\"'\" & AF$14 & \" Season Info'!L2:L15\"), \"\",  0, 1)","v":4.4400000000000004},{"$f":"IF(_xlfn.XLOOKUP($V22, INDIRECT(\"'\" & AF$14 & \" Season Info'!J2:J15\"), INDIRECT(\"'\" & AF$14 & \" Season Info'!K2:K15\"), \"\",  0, 1)=\"\", NA(), _xlfn.XLOOKUP($V22, INDIRECT(\"'\" & AF$14 & \" Season Info'!J2:J15\"), INDIRECT(\"'\" & AF$14 & \" Season Info'!K2:K15\"), \"\",  0, 1))","v":138},22.570000000000004]
["2005-04-19",null,null,null,5,5,null,5,5.2,5.01,4.6399999999999997,5,19.850000000000001,null,null,null,null,null,null,null,null,"2011-12",{"$f":"_xlfn.XLOOKUP($V23, INDIRECT(\"'\" & W$14 & \" Season Info'!J2:J15\"), INDIRECT(\"'\" & W$14 & \" Season Info'!C2:C15\"), \"\",  0, 1)","v":6},{"$f":"_xlfn.XLOOKUP($V23, INDIRECT(\"'\" & W$14 & \" Season Info'!J2:J15\"), INDIRECT(\"'\" & W$14 & \" Season Info'!L2:L15\"), \"\",  0, 1)","v":4.5999999999999996},{"$f":"IF(_xlfn.XLOOKUP($V23, INDIRECT(\"'\" & W$14 & \" Season Info'!J2:J15\"), INDIRECT(\"'\" & W$14 & \" Season Info'!K2:K15\"), \"\",  0, 1)=\"\", NA(), _xlfn.XLOOKUP($V23, INDIRECT(\"'\" & W$14 & \" Season Info'!J2:J15\"), INDIRECT(\"'\" & W$14 & \" Season Info'!K2:K15\"), \"\",  0, 1))","v":130},{"$f":"_xlfn.XLOOKUP($V23, INDIRECT(\"'\" & Z$14 & \" Season Info'!J2:J15\"), INDIRECT(\"'\" & Z$14 & \" Season Info'!C2:C15\"), \"\",  0, 1)","v":8},{"$f":"_xlfn.XLOOKUP($V23, INDIRECT(\"'\" & Z$14 & \" Season Info'!J2:J15\"), INDIRECT(\"'\" & Z$14 & \" Season Info'!L2:L15\"), \"\",  0, 1)","v":6.51},{"$f":"IF(_xlfn.XLOOKUP($V23, INDIRECT(\"'\" & Z$14 & \" Season Info'!J2:J15\"), INDIRECT(\"'\" & Z$14 & \" Season Info'!K2:K15\"), \"\",  0, 1)=\"\", NA(), _xlfn.XLOOKUP($V23, INDIRECT(\"'\" & Z$14 & \" Season Info'!J2:J15\"), INDIRECT(\"'\" & Z$14 & \" Season Info'!K2:K15\"), \"\",  0, 1))","v":78},{"$f":"_xlfn.XLOOKUP($V23, INDIRECT(\"'\" & AC$14 & \" Season Info'!J2:J15\"), INDIRECT(\"'\" & AC$14 & \" Season Info'!C2:C15\"), \"\",  0, 1)","v":4},{"$f":"_xlfn.XLOOKUP($V23, INDIRECT(\"'\" & AC$14 & \" Season Info'!J2:J15\"), INDIRECT(\"'\" & AC$14 & \" Season Info'!L2:L15\"), \"\",  0, 1)","v":4.4000000000000004},{"$f":"IF(_xlfn.XLOOKUP($V23, INDIRECT(\"'\" & AC$14 & \" Season Info'!J2:J15\"), INDIRECT(\"'\" & AC$14 & \" Season Info'!K2:K15\"), \"\",  0, 1)=\"\", NA(), _xlfn.XLOOKUP($V23, INDIRECT(\"'\" & AC$14 & \" Season Info'!J2:J15\"), INDIRECT(\"'\" & AC$14 & \" Season Info'!K2:K15\"), \"\",  0, 1))","v":134},{"$f":"_xlfn.XLOOKUP($V23, INDIRECT(\"'\" & AF$14 & \" Season Info'!J2:J15\"), INDIRECT(\"'\" & AF$14 & \" Season Info'!C2:C15\"), \"\",  0, 1)","v":3},{"$f":"_xlfn.XLOOKUP($V23, INDIRECT(\"'\" & AF$14 & \" Season Info'!J2:J15\"), INDIRECT(\"'\" & AF$14 & \" Season Info'!L2:L15\"), \"\",  0, 1)","v":4.03},{"$f":"IF(_xlfn.XLOOKUP($V23, INDIRECT(\"'\" & AF$14 & \" Season Info'!J2:J15\"), INDIRECT(\"'\" & AF$14 & \" Season Info'!K2:K15\"), \"\",  0, 1)=\"\", NA(), _xlfn.XLOOKUP($V23, INDIRECT(\"'\" & AF$14 & \" Season Info'!J2:J15\"), INDIRECT(\"'\" & AF$14 & \" Season Info'!K2:K15\"), \"\",  0, 1))","v":144},19.54]
["2005-04-26",null,null,null,4.8,4.8,null,6,6,5.18,4.25,4.8,20.23,null,null,null,null,null,null,null,null,"2012-13",{"$f":"_xlfn.XLOOKUP($V24, INDIRECT(\"'\" & W$14 & \" Season Info'!J2:J15\"), INDIRECT(\"'\" & W$14 & \" Season Info'!C2:C15\"), \"\",  0, 1)","v":7},{"$f":"_xlfn.XLOOKUP($V24, INDIRECT(\"'\" & W$14 & \" Season Info'!J2:J15\"), INDIRECT(\"'\" & W$14 & \" Season Info'!L2:L15\"), \"\",  0, 1)","v":4.5999999999999996},{"$f":"IF(_xlfn.XLOOKUP($V24, INDIRECT(\"'\" & W$14 & \" Season Info'!J2:J15\"), INDIRECT(\"'\" & W$14 & \" Season Info'!K2:K15\"), \"\",  0, 1)=\"\", NA(), _xlfn.XLOOKUP($V24, INDIRECT(\"'\" & W$14 & \" Season Info'!J2:J15\"), INDIRECT(\"'\" & W$14 & \" Season Info'!K2:K15\"), \"\",  0, 1))","v":99},{"$f":"_xlfn.XLOOKUP($V24, INDIRECT(\"'\" & Z$14 & \" Season Info'!J2:J15\"), INDIRECT(\"'\" & Z$14 & \" Season Info'!C2:C15\"), \"\",  0, 1)","v":9},{"$f":"_xlfn.XLOOKUP($V24, INDIRECT(\"'\" & Z$14 & \" Season Info'!J2:J15\"), INDIRECT(\"'\" & Z$14 & \" Season Info'!L2:L15\"), \"\",  0, 1)","v":5.0599999999999996},{"$f":"IF(_xlfn.XLOOKUP($V24, INDIRECT(\"'\" & Z$14 & \" Season Info'!J2:J15\"), INDIRECT(\"'\" & Z$14 & \" Season Info'!K2:K15\"), \"\",  0, 1)=\"\", NA(), _xlfn.XLOOKUP($V24, INDIRECT(\"'\" & Z$14 & \" Season Info'!J2:J15\"), INDIRECT(\"'\" & Z$14 & \" Season Info'!K2:K15\"), \"\",  0, 1))","v":88},{"$f":"_xlfn.XLOOKUP($V24, INDIRECT(\"'\" & AC$14 & \" Season Info'!J2:J15\"), INDIRECT(\"'\" & AC$14 & \" Season Info'!C2:C15\"), \"\",  0, 1)","v":5},{"$f":"_xlfn.XLOOKUP($V24, INDIRECT(\"'\" & AC$14 & \" Season Info'!J2:J15\"), INDIRECT(\"'\" & AC$14 & \" Season Info'!L2:L15\"), \"\",  0, 1)","v":4.0599999999999996},{"$f":"IF(_xlfn.XLOOKUP($V24, INDIRECT(\"'\" & AC$14 & \" Season Info'!J2:J15\"), INDIRECT(\"'\" & AC$14 & \" Season Info'!K2:K15\"), \"\",  0, 1)=\"\", NA(), _xlfn.XLOOKUP($V24, INDIRECT(\"'\" & AC$14 & \" Season Info'!J2:J15\"), INDIRECT(\"'\" & AC$14 & \" Season Info'!K2:K15\"), \"\",  0, 1))","v":111},{"$f":"_xlfn.XLOOKUP($V24, INDIRECT(\"'\" & AF$14 & \" Season Info'!J2:J15\"), INDIRECT(\"'\" & AF$14 & \" Season Info'!C2:C15\"), \"\",  0, 1)","v":4},{"$f":"_xlfn.XLOOKUP($V24, INDIRECT(\"'\" & AF$14 & \" Season Info'!J2:J15\"), INDIRECT(\"'\" & AF$14 & \" Season Info'!L2:L15\"), \"\",  0, 1)","v":3.58},{"$f":"IF(_xlfn.XLOOKUP($V24, INDIRECT(\"'\" & AF$14 & \" Season Info'!J2:J15\"), INDIRECT(\"'\" & AF$14 & \" Season Info'!K2:K15\"), \"\",  0, 1)=\"\", NA(), _xlfn.XLOOKUP($V24, INDIRECT(\"'\" & AF$14 & \" Season Info'!J2:J15\"), INDIRECT(\"'\" & AF$14 & \" Season Info'!K2:K15\"), \"\",  0, 1))","v":133},17.299999999999997]
["2005-09-20",null,null,null,9,9,null,7,6.8,5.32,null,null,12.120000000000001,null,"Full Lineup?","Yes",null,null,null,null,null,"2013-14",{"$f":"_xlfn.XLOOKUP($V25, INDIRECT(\"'\" & W$14 & \" Season Info'!J2:J15\"), INDIRECT(\"'\" & W$14 & \" Season Info'!C2:C15\"), \"\",  0, 1)","v":""},{"$f":"_xlfn.XLOOKUP($V25, INDIRECT(\"'\" & W$14 & \" Season Info'!J2:J15\"), INDIRECT(\"'\" & W$14 & \" Season Info'!L2:L15\"), \"\",  0, 1)","v":""},{"$f":"IF(_xlfn.XLOOKUP($V25, INDIRECT(\"'\" & W$14 & \" Season Info'!J2:J15\"), INDIRECT(\"'\" & W$14 & \" Season Info'!K2:K15\"), \"\",  0, 1)=\"\", NA(), _xlfn.XLOOKUP($V25, INDIRECT(\"'\" & W$14 & \" Season Info'!J2:J15\"), INDIRECT(\"'\" & W$14 & \" Season Info'!K2:K15\"), \"\",  0, 1))","v":{"$error":"#N/A"}},{"$f":"_xlfn.XLOOKUP($V25, INDIRECT(\"'\" & Z$14 & \" Season Info'!J2:J15\"), INDIRECT(\"'\" & Z$14 & \" Season Info'!C2:C15\"), \"\",  0, 1)","v":""},{"$f":"_xlfn.XLOOKUP($V25, INDIRECT(\"'\" & Z$14 & \" Season Info'!J2:J15\"), INDIRECT(\"'\" & Z$14 & \" Season Info'!L2:L15\"), \"\",  0, 1)","v":""},{"$f":"IF(_xlfn.XLOOKUP($V25, INDIRECT(\"'\" & Z$14 & \" Season Info'!J2:J15\"), INDIRECT(\"'\" & Z$14 & \" Season Info'!K2:K15\"), \"\",  0, 1)=\"\", NA(), _xlfn.XLOOKUP($V25, INDIRECT(\"'\" & Z$14 & \" Season Info'!J2:J15\"), INDIRECT(\"'\" & Z$14 & \" Season Info'!K2:K15\"), \"\",  0, 1))","v":{"$error":"#N/A"}},{"$f":"_xlfn.XLOOKUP($V25, INDIRECT(\"'\" & AC$14 & \" Season Info'!J2:J15\"), INDIRECT(\"'\" & AC$14 & \" Season Info'!C2:C15\"), \"\",  0, 1)","v":6},{"$f":"_xlfn.XLOOKUP($V25, INDIRECT(\"'\" & AC$14 & \" Season Info'!J2:J15\"), INDIRECT(\"'\" & AC$14 & \" Season Info'!L2:L15\"), \"\",  0, 1)","v":3.76},{"$f":"IF(_xlfn.XLOOKUP($V25, INDIRECT(\"'\" & AC$14 & \" Season Info'!J2:J15\"), INDIRECT(\"'\" & AC$14 & \" Season Info'!K2:K15\"), \"\",  0, 1)=\"\", NA(), _xlfn.XLOOKUP($V25, INDIRECT(\"'\" & AC$14 & \" Season Info'!J2:J15\"), INDIRECT(\"'\" & AC$14 & \" Season Info'!K2:K15\"), \"\",  0, 1))","v":115},{"$f":"_xlfn.XLOOKUP($V25, INDIRECT(\"'\" & AF$14 & \" Season Info'!J2:J15\"), INDIRECT(\"'\" & AF$14 & \" Season Info'!C2:C15\"), \"\",  0, 1)","v":5},{"$f":"_xlfn.XLOOKUP($V25, INDIRECT(\"'\" & AF$14 & \" Season Info'!J2:J15\"), INDIRECT(\"'\" & AF$14 & \" Season Info'!L2:L15\"), \"\",  0, 1)","v":3},{"$f":"IF(_xlfn.XLOOKUP($V25, INDIRECT(\"'\" & AF$14 & \" Season Info'!J2:J15\"), INDIRECT(\"'\" & AF$14 & \" Season Info'!K2:K15\"), \"\",  0, 1)=\"\", NA(), _xlfn.XLOOKUP($V25, INDIRECT(\"'\" & AF$14 & \" Season Info'!J2:J15\"), INDIRECT(\"'\" & AF$14 & \" Season Info'!K2:K15\"), \"\",  0, 1))","v":96},6.76]
["2005-09-27",null,null,null,7.13,7.13,null,8,5.9,5.45,null,null,11.350000000000001,null,null,null,null,null,null,null,null,"2014-15",{"$f":"_xlfn.XLOOKUP($V26, INDIRECT(\"'\" & W$14 & \" Season Info'!J2:J15\"), INDIRECT(\"'\" & W$14 & \" Season Info'!C2:C15\"), \"\",  0, 1)","v":""},{"$f":"_xlfn.XLOOKUP($V26, INDIRECT(\"'\" & W$14 & \" Season Info'!J2:J15\"), INDIRECT(\"'\" & W$14 & \" Season Info'!L2:L15\"), \"\",  0, 1)","v":""},{"$f":"IF(_xlfn.XLOOKUP($V26, INDIRECT(\"'\" & W$14 & \" Season Info'!J2:J15\"), INDIRECT(\"'\" & W$14 & \" Season Info'!K2:K15\"), \"\",  0, 1)=\"\", NA(), _xlfn.XLOOKUP($V26, INDIRECT(\"'\" & W$14 & \" Season Info'!J2:J15\"), INDIRECT(\"'\" & W$14 & \" Season Info'!K2:K15\"), \"\",  0, 1))","v":{"$error":"#N/A"}},{"$f":"_xlfn.XLOOKUP($V26, INDIRECT(\"'\" & Z$14 & \" Season Info'!J2:J15\"), INDIRECT(\"'\" & Z$14 & \" Season Info'!C2:C15\"), \"\",  0, 1)","v":""},{"$f":"_xlfn.XLOOKUP($V26, INDIRECT(\"'\" & Z$14 & \" Season Info'!J2:J15\"), INDIRECT(\"'\" & Z$14 & \" Season Info'!L2:L15\"), \"\",  0, 1)","v":""},{"$f":"IF(_xlfn.XLOOKUP($V26, INDIRECT(\"'\" & Z$14 & \" Season Info'!J2:J15\"), INDIRECT(\"'\" & Z$14 & \" Season Info'!K2:K15\"), \"\",  0, 1)=\"\", NA(), _xlfn.XLOOKUP($V26, INDIRECT(\"'\" & Z$14 & \" Season Info'!J2:J15\"), INDIRECT(\"'\" & Z$14 & \" Season Info'!K2:K15\"), \"\",  0, 1))","v":{"$error":"#N/A"}},{"$f":"_xlfn.XLOOKUP($V26, INDIRECT(\"'\" & AC$14 & \" Season Info'!J2:J15\"), INDIRECT(\"'\" & AC$14 & \" Season Info'!C2:C15\"), \"\",  0, 1)","v":7},{"$f":"_xlfn.XLOOKUP($V26, INDIRECT(\"'\" & AC$14 & \" Season Info'!J2:J15\"), INDIRECT(\"'\" & AC$14 & \" Season Info'!L2:L15\"), \"\",  0, 1)","v":4.57},{"$f":"IF(_xlfn.XLOOKUP($V26, INDIRECT(\"'\" & AC$14 & \" Season Info'!J2:J15\"), INDIRECT(\"'\" & AC$14 & \" Season Info'!K2:K15\"), \"\",  0, 1)=\"\", NA(), _xlfn.XLOOKUP($V26, INDIRECT(\"'\" & AC$14 & \" Season Info'!J2:J15\"), INDIRECT(\"'\" & AC$14 & \" Season Info'!K2:K15\"), \"\",  0, 1))","v":119},{"$f":"_xlfn.XLOOKUP($V26, INDIRECT(\"'\" & AF$14 & \" Season Info'!J2:J15\"), INDIRECT(\"'\" & AF$14 & \" Season Info'!C2:C15\"), \"\",  0, 1)","v":6},{"$f":"_xlfn.XLOOKUP($V26, INDIRECT(\"'\" & AF$14 & \" Season Info'!J2:J15\"), INDIRECT(\"'\" & AF$14 & \" Season Info'!L2:L15\"), \"\",  0, 1)","v":0},{"$f":"IF(_xlfn.XLOOKUP($V26, INDIRECT(\"'\" & AF$14 & \" Season Info'!J2:J15\"), INDIRECT(\"'\" & AF$14 & \" Season Info'!K2:K15\"), \"\",  0, 1)=\"\", NA(), _xlfn.XLOOKUP($V26, INDIRECT(\"'\" & AF$14 & \" Season Info'!J2:J15\"), INDIRECT(\"'\" & AF$14 & \" Season Info'!K2:K15\"), \"\",  0, 1))","v":{"$error":"#N/A"}},4.57]
["2005-10-04",null,null,null,8.3000000000000007,8.3000000000000007,null,9,5.9,5.09,null,null,10.99,null,"Sum of U.S. viewers(millions)","Column Labels"]
["2005-10-11",null,null,null,7.6,7.6,null,10,6.1,4.8600000000000003,null,null,10.96,null,"Row Labels","2009-10","Grand Total"]
["2005-10-18",null,null,null,8,8,null,11,5,5.42,null,null,10.42,null,"30 Rock",107.3,107.3]
["2005-11-01",null,null,null,7.9,7.9,null,12,5.7,5.51,null,null,11.21,null,"Community",89.54,89.54]
["2005-11-08",null,null,null,7.5,7.5,null,13,5.2,5.42,null,null,10.620000000000001,null,"Parks and Rec",83.47,83.47]
["2005-11-15",null,null,null,8,8,null,14,5,4.7300000000000004,null,null,9.73,null,"The Office",135.97000000000003,135.97000000000003]
["2005-11-22",null,null,null,8.1,8.1,null,15,4.5999999999999996,5.23,null,null,9.83,null,"Grand Total",416.28000000000003,416.28000000000003]
["2005-12-06",null,null,null,9.6999999999999993,9.6999999999999993,null,16,5.7,5.15,null,null,10.850000000000001]
["2006",48.29999999999999,null,null,192.98000000000002,241.28000000000003,null,17,5.2,5.0599999999999996,null,null,10.26]
["2006-01-05",null,null,null,8.6999999999999993,8.6999999999999993,null,18,5.4,4.7,null,null,10.100000000000001,null,"Full Lineup?","Yes"]
["2006-01-12",null,null,null,10.3,10.3,null,19,5.0999999999999996,5.21,null,null,10.309999999999999]
["2006-01-19",null,null,null,8.6999999999999993,8.6999999999999993,null,20,5.2,5.07,null,null,10.27,null,"Sum of U.S. viewers(millions)","Column Labels"]
["2006-01-26",null,null,null,8.6,8.6,null,21,4.7,3.67,null,null,8.370000000000001,null,"Row Labels","2010-11","Grand Total"]
["2006-02-02",null,null,null,5.42,5.42,null,22,null,4.3600000000000003,null,null,4.3600000000000003,null,"30 Rock",45.81,45.81]
["2006-02-09",null,null,null,8.9499999999999993,8.9499999999999993,null,23,null,4.3499999999999996,null,null,4.3499999999999996,null,"Community",40.010000000000005,40.010000000000005]
["2006-03-02",null,null,null,8.4,8.4,null,24,null,4.49,null,null,4.49,null,"Parks and Rec",51.120000000000005,51.120000000000005]
["2006-03-16",null,null,null,8.8000000000000007,8.8000000000000007,null,25,null,4.41,null,null,4.41,null,"The Office",71.599999999999994,71.599999999999994]
["2006-03-30",null,null,null,7.8,7.8,null,"Season 2",91.399999999999991,101.86999999999999,111.52,179.70000000000005,484.49,null,"Grand Total",208.54,208.54]
["2006-04-27",null,null,null,7.8,7.8,null,1,7.3,5.01,5,9,26.31]
["2006-05-04",null,null,null,7.4,7.4,null,2,6.6,4.53,4.22,7.13,22.479999999999997]
["2006-05-11",null,null,null,7.6,7.6,null,3,6.2,4.2,4.63,8.3000000000000007,23.330000000000002,null,"Full Lineup?","Yes"]
["2006-09-21",null,null,null,9.11,9.11,null,4,6.5,4.8099999999999996,4.97,7.6,23.879999999999995]
["2006-09-28",null,null,null,7.78,7.78,null,5,6.6,4.46,4.6900000000000004,8,23.75,null,"Sum of U.S. viewers(millions)","Column Labels"]
["2006-10-05",null,null,null,8.89,8.89,null,6,5.8,5.64,4.9800000000000004,7.9,24.32,null,"Row Labels","2011-12","Grand Total"]
["2006-10-11",8.1,null,null,null,8.1,null,7,6.4,4.6100000000000003,4.96,7.5,23.470000000000002,null,"30 Rock",12.49,12.49]
["2006-10-12",null,null,null,8.83,8.83,null,8,5.8,4.53,4.9400000000000004,8,23.27,null,"Community",12.17,12.17]
["2006-10-18",5.7,null,null,null,5.7,null,9,5.6,4.41,4.67,8.1,22.78,null,"Parks and Rec",13.309999999999999,13.309999999999999]
["2006-10-19",null,null,null,8.4600000000000009,8.4600000000000009,null,10,6,4.55,4.6100000000000003,9.6999999999999993,24.86,null,"The Office",17.45,17.45]
["2006-10-25",6,null,null,null,6,null,11,5.7,4.29,4.83,8.6999999999999993,23.52,null,"Grand Total",55.42,55.42]
["2006-11-01",4.5999999999999996,null,null,null,4.5999999999999996,null,12,6.4,4.7300000000000004,4.9000000000000004,10.3,26.330000000000002]
["2006-11-02",null,null,null,8.81,8.81,null,13,5.5,4.59,4.59,8.6999999999999993,23.38]
["2006-11-09",null,null,null,8.0500000000000007,8.0500000000000007,null,14,5.4,4.37,4.3499999999999996,8.6,22.72]
["2006-11-16",5.2,null,null,8.6300000000000008,13.830000000000002,null,15,5.6,3.81,4.87,5.42,19.700000000000003]
["2006-11-30",6,null,null,9.07,15.07,null,16,null,4.1100000000000003,4.9800000000000004,8.9499999999999993,18.04,null,"U.S. Viewership by Timeslot"]
["2006-12-07",6.8,null,null,null,6.8,null,17,null,3.79,4.6399999999999997,8.4,16.829999999999998,null,"Day","Thu"]
["2006-12-14",5.9,null,null,16.88,22.78,null,18,null,4.1500000000000004,4.6100000000000003,8.8000000000000007,17.560000000000002,null,"Show","(All)"]
["2007",125.6,null,null,222.89999999999998,348.5,null,19,null,4.46,4.7,7.8,16.96]
["2007-01-04",5.9,null,null,8.8000000000000007,14.700000000000001,null,20,null,3.49,4.49,7.8,15.780000000000001,null,"Sum of U.S. viewers(millions)","Column Labels"]
["2007-01-11",6.1,null,null,10.119999999999999,16.22,null,21,null,3.17,4.03,7.4,14.600000000000001,null,"Row Labels","20:00:00","20:30:00","21:00:00","21:30:00","22:00:00","22:30:00","23:00:00","Grand Total"]
["2007-01-18",5,null,null,10.199999999999999,15.2,null,22,null,3.35,4.03,7.6,14.98,null,"2005"]
["2007-02-01",5.7,null,null,10.11,15.809999999999999,null,23,null,3.49,4.28,null,7.7700000000000005,null,"2005-03-24",null,null,null,11.2,null,null,null,11.2]
["2007-02-08",5.2,null,null,8.84,14.04,null,24,null,3.32,4.55,null,7.8699999999999992,null,"2006"]
["2007-02-15",5,null,null,8.84,13.84,null,"Season 3",152.6,75.17,75.990000000000009,211.69000000000003,515.45000000000005,null,"2006-01-05",null,null,null,8.6999999999999993,null,null,null,8.6999999999999993]
["2007-02-22",4.5999999999999996,null,null,8.3000000000000007,12.9,null,1,8.6999999999999993,3.93,6.14,9.11,27.88,null,"2006-01-12",null,null,null,10.3,null,null,null,10.3]
["2007-03-01",5.7,null,null,null,5.7,null,2,8,3.98,5.83,7.78,25.590000000000003,null,"2006-01-19",null,null,null,8.6999999999999993,null,null,null,8.6999999999999993]
["2007-03-08",5.2,null,null,null,5.2,null,3,7.5,3.35,4.95,8.89,24.69,null,"2006-01-26",null,null,null,8.6,null,null,null,8.6]
["2007-04-05",5.4,null,null,6.74,12.14,null,4,7.3,3.78,5.03,8.83,24.939999999999998,null,"2006-02-02",null,null,null,5.42,null,null,null,5.42]
["2007-04-12",5.0999999999999996,null,null,7.71,12.809999999999999,null,5,7.1,3.42,4.33,8.4600000000000009,23.310000000000002,null,"2006-02-09",null,null,null,8.9499999999999993,null,null,null,8.9499999999999993]
["2007-04-19",5.2,null,null,null,5.2,null,6,8.9,3.84,4.59,8.81,26.14,null,"2006-03-02",null,null,null,8.4,null,null,null,8.4]
["2007-04-26",4.7,null,null,7.56,12.26,null,7,5.4,3.49,4.08,8.0500000000000007,21.020000000000003,null,"2006-03-16",null,null,null,8.8000000000000007,null,null,null,8.8000000000000007]
["2007-05-03",null,null,null,7,7,null,8,6.6,3.62,5.15,8.6300000000000008,24,null,"2006-03-30",null,null,null,7.8,null,null,null,7.8]
["2007-05-10",null,null,null,7.2,7.2,null,9,6.4,3.74,5.16,9.07,24.37,null,"2006-04-27",null,null,null,7.8,null,null,null,7.8]
["2007-05-17",null,null,null,15.76,15.76,null,10,6.4,3.6,4.88,8.44,23.32,null,"2006-05-04",null,null,null,7.4,null,null,null,7.4]
["2007-09-27",null,null,null,19.399999999999999,19.399999999999999,null,11,7.6,4.75,4.71,8.44,25.5,null,"2006-05-11",null,null,null,7.6,null,null,null,7.6]
["2007-10-04",7.3,null,null,16.98,24.28,null,12,6.4,3.87,5.0599999999999996,8.8000000000000007,24.13,null,"2006-09-21",null,9.11,null,null,null,null,null,9.11]
["2007-10-11",6.6,null,null,17.82,24.42,null,13,7.3,3.48,4.55,10.119999999999999,25.449999999999996,null,"2006-09-28",null,7.78,null,null,null,null,null,7.78]
["2007-10-18",6.2,null,null,17,23.2,null,14,6.4,3,3.54,10.199999999999999,23.14,null,"2006-10-05",null,8.89,null,null,null,null,null,8.89]
["2007-10-25",6.5,null,null,8.98,15.48,null,15,7.1,3.09,4.2699999999999996,10.11,24.57,null,"2006-10-12",null,8.83,null,null,null,null,null,8.83]
["2007-11-01",null,null,null,8.39,8.39,null,16,7.2,2.77,3.72,8.84,22.53,null,"2006-10-19",null,8.4600000000000009,null,null,null,null,null,8.4600000000000009]
["2007-11-08",6.6,null,null,8.2899999999999991,14.889999999999999,null,17,6.8,3.21,null,8.84,18.850000000000001,null,"2006-11-02",null,8.81,null,null,null,null,null,8.81]
["2007-11-15",5.8,null,null,8.86,14.66,null,18,7.3,3.2,null,8.3000000000000007,18.8,null,"2006-11-09",null,8.0500000000000007,null,null,null,null,null,8.0500000000000007]
["2007-11-29",6.4,null,null,null,6.4,null,19,6.3,2.99,null,6.74,16.03,null,"2006-11-16",null,8.6300000000000008,null,5.2,null,null,null,13.830000000000002]
["2007-12-06",5.8,null,null,null,5.8,null,20,6,2.97,null,7.71,16.68,null,"2006-11-30",null,9.07,null,6,null,null,null,15.07]
["2007-12-13",5.6,null,null,null,5.6,null,21,6.2,2.61,null,7.56,16.37,null,"2006-12-07",null,null,null,6.8,null,null,null,6.8]
["2008",82.1,null,null,152.19,234.29000000000002,null,22,5.7,2.48,null,7,15.18,null,"2006-12-14",null,8.44,8.44,5.9,null,null,null,22.78]
["2008-01-10",6,null,null,null,6,null,23,null,null,null,7.2,7.2,null,"2007"]
["2008-04-10",5.7,null,null,9.2200000000000006,14.920000000000002,null,24,null,null,null,7.88,7.88,null,"2007-01-04",null,8.8000000000000007,null,5.9,null,null,null,14.700000000000001]
["2008-04-17",6.4,null,null,9.81,16.21,null,25,null,null,null,7.88,7.88,null,"2007-01-11",null,10.119999999999999,null,6.1,null,null,null,16.22]
["2008-04-24",5.5,null,null,7.56,13.059999999999999,null,"Season 4",126.59,37.74,82.2,163.33999999999997,409.87,null,"2007-01-18",null,10.199999999999999,null,5,null,null,null,15.2]
["2008-05-01",5.4,null,null,7.67,13.07,null,1,6.39,3.88,4.1100000000000003,9.6999999999999993,24.08,null,"2007-02-01",null,10.11,null,5.7,null,null,null,15.809999999999999]
["2008-05-08",5.6,null,null,7.22,12.82,null,2,6.68,2.76,4.33,9.6999999999999993,23.47,null,"2007-02-08",null,8.84,null,5.2,null,null,null,14.04]
["2008-05-15",null,null,null,16.14,16.14,null,3,6.01,3.08,4.1500000000000004,8.49,21.73,null,"2007-02-15",null,8.84,null,5,null,null,null,13.84]
["2008-09-25",null,null,null,18.399999999999999,18.399999999999999,null,4,6.15,2.83,3.99,8.49,21.46,null,"2007-02-22",null,8.3000000000000007,null,4.5999999999999996,null,null,null,12.9]
["2008-10-09",null,null,null,8.99,8.99,null,5,6,3.29,3.9,8.91,22.1,null,"2007-03-01",null,null,null,5.7,null,null,null,5.7]
["2008-10-16",null,null,null,8.07,8.07,null,6,5.72,2.58,4,8.91,21.21,null,"2007-03-08",null,null,null,5.2,null,null,null,5.2]
["2008-10-23",null,null,null,7.74,7.74,null,7,6.08,2.95,3.66,8.5,21.19,null,"2007-04-05",null,6.74,5.4,null,null,null,null,12.14]
["2008-10-30",8.6999999999999993,null,null,9.32,18.02,null,8,6.7,2.3199999999999998,3.68,8.5,21.2,null,"2007-04-12",null,7.71,5.0999999999999996,null,null,null,null,12.809999999999999]
["2008-11-06",8,null,null,8.35,16.350000000000001,null,9,5.12,2.84,3.69,8.98,20.630000000000003,null,"2007-04-19",null,null,5.2,null,null,null,null,5.2]
["2008-11-13",7.5,null,null,8.18,15.68,null,10,5.01,3.13,3.64,8.39,20.170000000000002,null,"2007-04-26",null,7.56,4.7,null,null,null,null,12.26]
["2008-11-20",7.3,null,null,8.4,15.7,null,11,5.58,2.33,4.09,8.2899999999999991,20.29,null,"2007-05-03",null,7,null,null,null,null,null,7]
["2008-12-04",7.1,null,null,8.33,15.43,null,12,5.79,2.67,4.25,8.86,21.57,null,"2007-05-10",null,7.2,null,null,null,null,null,7.2]
["2008-12-11",8.9,null,null,8.7899999999999991,17.689999999999998,null,13,6,3.08,3.49,9.2200000000000006,21.79,null,"2007-05-17",null,7.88,7.88,null,null,null,null,15.76]
["2009",154.82999999999998,65.850000000000009,89.509999999999991,271.42,581.61,null,14,5.89,null,3.6,9.81,19.3,null,"2007-09-27",null,null,9.6999999999999993,9.6999999999999993,null,null,null,19.399999999999999]
["2009-01-08",5.4,null,null,null,5.4,null,15,6.79,null,3.45,7.56,17.8,null,"2007-10-04",null,7.3,8.49,8.49,null,null,null,24.28]
["2009-01-15",6.6,null,null,8.5,15.1,null,16,6.25,null,3.43,7.67,17.350000000000001,null,"2007-10-11",null,6.6,8.91,8.91,null,null,null,24.42]
["2009-01-22",6.4,null,null,8.74,15.14,null,17,4,null,3.77,7.22,14.989999999999998,null,"2007-10-18",null,6.2,8.5,8.5,null,null,null,23.2]
["2009-02-01",null,null,null,45.82,45.82,null,18,5.16,null,3.66,8.07,16.89,null,"2007-10-25",null,6.5,8.98,null,null,null,null,15.48]
["2009-02-05",6.4,null,null,8.39,14.790000000000001,null,19,5.44,null,3.46,8.07,16.97,null,"2007-11-01",null,null,8.39,null,null,null,null,8.39]
["2009-02-12",7.6,null,null,8.89,16.490000000000002,null,20,5.42,null,3.17,null,8.59,null,"2007-11-08",null,6.6,8.2899999999999991,null,null,null,null,14.889999999999999]
["2009-02-26",6.4,null,null,null,6.4,null,21,4.96,null,3.26,null,8.2199999999999989,null,"2007-11-15",null,5.8,8.86,null,null,null,null,14.66]
["2009-03-05",7.3,null,null,8.6300000000000008,15.93,null,22,5.45,null,3.42,null,8.870000000000001,null,"2007-11-29",null,6.4,null,null,null,null,null,6.4]
["2009-03-12",6.4,null,null,7.51,13.91,null,"Season 5",111.51,39.03,72.509999999999991,259.78000000000003,482.82999999999993,null,"2007-12-06",null,5.8,null,null,null,null,null,5.8]
["2009-03-19",7.1,null,null,7.95,15.05,null,1,5.85,3.49,3.5,9.1999999999999993,22.04,null,"2007-12-13",null,null,5.6,null,null,null,null,5.6]
["2009-03-26",7.2,null,null,8.4499999999999993,15.649999999999999,null,2,5.68,3.49,3.27,9.1999999999999993,21.64,null,"2008"]
["2009-04-09",6.8,null,6.77,15.14,28.71,null,3,4.9000000000000004,3.58,3.53,8.99,21,null,"2008-01-10",null,6,null,null,null,null,null,6]
["2009-04-16",7.3,null,5.92,8.24,21.46,null,4,6.7,3.07,3.46,8.07,21.3,null,"2008-04-10",null,5.7,9.2200000000000006,null,null,null,null,14.920000000000002]
["2009-04-23",6.3,null,5.24,7.21,18.75,null,5,5.18,3.02,3.34,7.74,19.28,null,"2008-04-17",null,6.4,9.81,null,null,null,null,16.21]
["2009-04-30",6,null,5.29,7.31,18.599999999999998,null,6,5.31,3.01,3.46,9.32,21.1,null,"2008-04-24",null,null,7.56,5.5,null,null,null,13.059999999999999]
["2009-05-07",6.2,null,4.6399999999999997,7.71,18.55,null,7,5.09,2.56,3.52,8.35,19.52,null,"2008-05-01",null,null,7.67,5.4,null,null,null,13.07]
["2009-05-14",5.7,null,4.25,6.72,16.669999999999998,null,8,5.1100000000000003,2.79,2.99,8.18,19.07,null,"2008-05-08",null,null,7.22,5.6,null,null,null,12.82]
["2009-09-17",null,7.89,5,8.1999999999999993,21.09,null,9,5.03,2.77,3.27,8.4,19.47,null,"2008-05-15",null,null,8.07,8.07,null,null,null,16.14]
["2009-09-24",null,5.39,4.22,7.33,16.939999999999998,null,10,4.76,3.32,3.92,8.33,20.329999999999998,null,"2008-09-25",null,null,9.1999999999999993,9.1999999999999993,null,null,null,18.399999999999999]
["2009-10-01",null,5.86,4.63,7.28,17.77,null,11,5.34,2.5,3.94,8.7899999999999991,20.57,null,"2008-10-09",null,null,8.99,null,null,null,null,8.99]
["2009-10-08",null,4.87,4.97,18.84,28.68,null,12,4.92,2.56,3.76,8.5,19.740000000000002,null,"2008-10-16",null,null,8.07,null,null,null,null,8.07]
["2009-10-15",6.39,5.01,4.6900000000000004,8.1,24.189999999999998,null,13,4.78,2.87,3.18,8.74,19.57,null,"2008-10-23",null,null,7.74,null,null,null,null,7.74]
["2009-10-22",6.68,5.18,4.9800000000000004,8.52,25.36,null,14,4.59,null,3.07,22.91,30.57,null,"2008-10-30",null,null,9.32,8.6999999999999993,null,null,null,18.02]
["2009-10-29",6.01,5.32,4.96,8.1999999999999993,24.49,null,15,4.07,null,2.95,22.91,29.93,null,"2008-11-06",null,null,8.35,8,null,null,null,16.350000000000001]
["2009-11-05",6.15,5.45,4.9400000000000004,7.94,24.480000000000004,null,16,4.5,null,3,8.39,15.89,null,"2008-11-13",null,null,8.18,7.5,null,null,null,15.68]
["2009-11-12",6,5.09,4.67,7.76,23.52,null,17,4.1900000000000004,null,2.93,8.89,16.010000000000002,null,"2008-11-20",null,null,8.4,7.3,null,null,null,15.7]
["2009-11-19",5.72,4.8600000000000003,4.6100000000000003,7.43,22.62,null,18,4.3600000000000003,null,3.15,8.6300000000000008,16.14,null,"2008-12-04",null,null,8.33,7.1,null,null,null,15.43]
["2009-12-03",6.08,5.42,4.83,8.1,24.43,null,19,4.45,null,3.35,7.51,15.31,null,"2008-12-11",null,null,8.7899999999999991,8.9,null,null,null,17.689999999999998]
["2009-12-10",6.7,5.51,4.9000000000000004,8.51,25.619999999999997,null,20,4.5999999999999996,null,3.34,7.95,15.89,null,"2009"]
["2010",130.47,112.89000000000001,54.120000000000005,184.47000000000003,481.94999999999993,null,21,3.95,null,2.59,8.4499999999999993,14.989999999999998,null,"2009-01-08",null,null,null,5.4,null,null,null,5.4]
["2010-01-14",10.129999999999999,5.42,4.59,null,20.14,null,22,3.95,null,2.99,7.2,14.14,null,"2009-01-15",null,null,8.5,6.6,null,null,null,15.1]
["2010-01-21",5.58,4.7300000000000004,4.3499999999999996,7.29,21.95,null,23,4.2,null,null,7.94,12.14,null,"2009-01-22",null,null,8.74,6.4,null,null,null,15.14]
["2010-02-04",5.79,5.23,4.87,7.36,23.25,null,24,null,null,null,8.24,8.24,null,"2009-02-05",null,null,8.39,6.4,null,null,null,14.790000000000001]
["2010-02-11",6,5.15,4.9800000000000004,7.4,23.53,null,25,null,null,null,7.21,7.21,null,"2009-02-12",null,null,8.89,7.6,null,null,null,16.490000000000002]
["2010-03-04",null,5.0599999999999996,4.6399999999999997,18,27.7,null,26,null,null,null,7.31,7.31,null,"2009-02-26",null,null,null,6.4,null,null,null,6.4]
["2010-03-11",5.89,4.7,4.6100000000000003,7.51,22.71,null,27,null,null,null,7.71,7.71,null,"2009-03-05",null,null,8.6300000000000008,7.3,null,null,null,15.93]
["2010-03-18",6.79,5.21,4.7,7.63,24.33,null,28,null,null,null,6.72,6.72,null,"2009-03-12",null,null,7.51,6.4,null,null,null,13.91]
["2010-03-25",6.25,5.07,4.49,7.17,22.98,null,"Season 6",76.470000000000013,null,64.63,201.91999999999996,343.02000000000004,null,"2009-03-19",null,null,7.95,7.1,null,null,null,15.05]
["2010-04-22",9.16,3.67,null,6.3,19.13,null,1,4.47,null,3.27,8.1999999999999993,15.94,null,"2009-03-26",null,null,8.4499999999999993,7.2,null,null,null,15.649999999999999]
["2010-04-29",5.44,4.3600000000000003,4.03,7.01,20.840000000000003,null,2,4.05,null,3.27,7.33,14.65,null,"2009-04-09",null,6.77,15.14,6.8,null,null,null,28.71]
["2010-05-06",5.42,4.3499999999999996,4.03,6.84,20.64,null,3,3.82,null,3.14,7.28,14.24,null,"2009-04-16",null,5.92,8.24,7.3,null,null,null,21.46]
["2010-05-13",4.96,4.49,4.28,6.6,20.329999999999998,null,4,3.98,null,3.23,9.42,16.63,null,"2009-04-23",null,5.24,7.21,6.3,null,null,null,18.75]
["2010-05-20",5.45,4.41,4.55,6.6,21.009999999999998,null,5,3.23,null,3.27,9.42,15.92,null,"2009-04-30",null,5.29,7.31,6,null,null,null,18.600000000000001]
["2010-09-23",5.85,5.01,null,8.4,19.259999999999998,null,6,3.88,null,3.03,8.1,15.01,null,"2009-05-07",null,4.6399999999999997,7.71,6.2,null,null,null,18.55]
["2010-09-30",5.68,4.53,null,7.36,17.57,null,7,3.59,null,3.03,8.52,15.139999999999999,null,"2009-05-14",null,4.25,6.72,5.7,null,null,null,16.669999999999998]
["2010-10-07",4.9000000000000004,4.2,null,6.95,16.05,null,8,3.59,null,2.81,8.1999999999999993,14.6,null,"2009-09-17",null,5,8.1999999999999993,7.89,null,null,null,21.09]
["2010-10-14",6.7,4.8099999999999996,null,7.36,18.87,null,9,3.7,null,2.81,7.94,14.45,null,"2009-09-24",null,4.22,7.33,5.39,null,null,null,16.940000000000001]
["2010-10-21",5.18,4.46,null,6.87,16.510000000000002,null,10,3.77,null,3.43,7.76,14.96,null,"2009-10-01",null,4.63,7.28,5.86,null,null,null,17.77]
["2010-10-28",null,5.64,null,8.07,13.71,null,11,3.42,null,3.05,7.43,13.899999999999999,null,"2009-10-08",4.87,4.97,9.42,9.42,null,null,null,28.68]
["2010-11-04",5.31,4.6100000000000003,null,7.65,17.57,null,12,4,null,2.98,8.1,15.08,null,"2009-10-15",5.01,4.6900000000000004,8.1,6.39,null,null,null,24.189999999999998]
["2010-11-11",5.09,4.53,null,7.15,16.770000000000003,null,13,3.31,null,3.03,8.51,14.85,null,"2009-10-22",5.18,4.9800000000000004,8.52,6.68,null,null,null,25.36]
["2010-11-18",5.1100000000000003,4.41,null,7.28,16.8,null,14,3.42,null,2.52,7.29,13.23,null,"2009-10-29",5.32,4.96,8.1999999999999993,6.01,null,null,null,24.490000000000002]
["2010-12-02",5.03,4.55,null,7.31,16.89,null,15,3.14,null,2.95,7.36,13.45,null,"2009-11-05",5.45,4.9400000000000004,7.94,6.15,null,null,null,24.480000000000004]
["2010-12-09",4.76,4.29,null,14.36,23.41,null,16,2.79,null,2.72,7.4,12.91,null,"2009-11-12",5.09,4.67,7.76,6,null,null,null,23.52]
["2011",57.900000000000006,87.58,115.14000000000001,161.93,422.55000000000007,null,17,2.98,null,3.05,9,15.03,null,"2009-11-19",4.8600000000000003,4.6100000000000003,7.43,5.72,null,null,null,22.619999999999997]
["2011-01-20",5.34,4.7300000000000004,6.14,8.26,24.47,null,18,3.06,null,2.67,9,14.73,null,"2009-12-03",5.42,4.83,8.1,6.08,null,null,null,24.43]
["2011-01-27",4.92,4.59,5.83,7.93,23.27,null,19,3.47,null,2.56,7.51,13.54,null,"2009-12-10",5.51,4.9000000000000004,8.51,6.7,null,null,null,25.62]
["2011-02-03",4.78,4.37,4.95,7.29,21.39,null,20,3.04,null,2.39,7.63,13.059999999999999,null,"2010"]
["2011-02-10",4.59,3.81,5.03,6.9,20.329999999999998,null,21,2.92,null,2.71,7.17,12.8,null,"2010-01-14",5.42,4.59,5.12,5.01,null,null,null,20.14]
["2011-02-17",4.07,4.1100000000000003,4.33,6.41,18.920000000000002,null,22,2.84,null,2.71,6.3,11.85,null,"2010-01-21",4.7300000000000004,4.3499999999999996,7.29,5.58,null,null,null,21.950000000000003]
["2011-02-24",4.5,3.79,4.59,6.12,19,null,23,null,null,null,7.01,7.01,null,"2010-02-04",5.23,4.87,7.36,5.79,null,null,null,23.25]
["2011-03-17",4.1900000000000004,4.1500000000000004,4.08,null,12.42,null,24,null,null,null,6.84,6.84,null,"2010-02-11",5.15,4.9800000000000004,7.4,6,null,null,null,23.53]
["2011-03-24",4.3600000000000003,4.46,5.15,7.07,21.04,null,25,null,null,null,6.6,6.6,null,"2010-03-04",5.0599999999999996,4.6399999999999997,9,9,null,null,null,27.7]
["2011-04-14",4.45,3.49,5.16,7.87,20.970000000000002,null,26,null,null,null,6.6,6.6,null,"2010-03-11",4.7,4.6100000000000003,7.51,5.89,null,null,null,22.71]
["2011-04-21",4.5999999999999996,3.17,4.88,6.85,19.5,null,"Season 7",47.38,null,43.309999999999995,189.80999999999995,280.5,null,"2010-03-18",5.21,4.7,7.63,6.79,null,null,null,24.33]
["2011-04-28",7.9,3.35,4.71,8.42,24.380000000000003,null,1,3.46,null,3.75,8.4,15.61,null,"2010-03-25",5.07,4.49,7.17,6.25,null,null,null,22.98]
["2011-05-05",4.2,3.49,5.0599999999999996,6.9,19.649999999999999,null,2,3.4,null,3.25,7.36,14.010000000000002,null,"2010-04-22",3.67,4,11.46,null,null,null,null,19.130000000000003]
["2011-05-12",null,3.32,8.09,6.45,17.86,null,3,3.04,null,3.87,6.95,13.86,null,"2010-04-29",4.3600000000000003,4.03,7.01,5.44,null,null,null,20.84]
["2011-05-19",null,null,7.99,14.58,22.57,null,4,3.13,null,3.3,7.36,13.79,null,"2010-05-06",4.3499999999999996,4.03,6.84,5.42,null,null,null,20.64]
["2011-09-22",null,3.93,4.1100000000000003,7.64,15.68,null,5,3.38,null,3.48,6.87,13.73,null,"2010-05-13",4.49,4.28,6.6,4.96,null,null,null,20.329999999999998]
["2011-09-29",null,3.98,4.33,6.7,15.010000000000002,null,6,3.34,null,2.97,8.07,14.38,null,"2010-05-20",4.41,4.55,6.6,5.45,null,null,null,21.01]
["2011-10-06",null,3.35,4.1500000000000004,5.82,13.32,null,7,3.61,null,3.45,7.65,14.71,null,"2010-09-23",5.01,5.85,8.4,null,null,null,null,19.259999999999998]
["2011-10-13",null,3.78,3.99,6.08,13.85,null,8,3.22,null,3.06,7.15,13.43,null,"2010-09-30",4.53,5.68,7.36,null,null,null,null,17.57]
["2011-10-27",null,3.42,3.9,5.53,12.850000000000001,null,9,3.79,null,2.4700000000000002,7.28,13.54,null,"2010-10-07",4.2,4.9000000000000004,6.95,null,null,null,null,16.05]
["2011-11-03",null,3.84,4,6.15,13.99,null,10,3.44,null,2.94,7.31,13.69,null,"2010-10-14",4.8099999999999996,6.7,7.36,null,null,null,null,18.87]
["2011-11-10",null,3.49,3.66,5.96,13.11,null,11,3.81,null,2.4700000000000002,7.18,13.46,null,"2010-10-21",4.46,5.18,6.87,null,null,null,null,16.510000000000002]
["2011-11-17",null,3.62,3.68,5.5,12.8,null,12,4.88,null,4.1500000000000004,7.18,16.21,null,"2010-10-28",5.64,null,8.07,null,null,null,null,13.71]
["2011-12-01",null,3.74,3.69,5.71,13.14,null,13,4.88,null,4.1500000000000004,8.26,17.29,null,"2010-11-04",4.6100000000000003,5.31,7.65,null,null,null,null,17.57]
["2011-12-08",null,3.6,3.64,5.79,13.030000000000001,null,14,null,null,null,7.93,7.93,null,"2010-11-11",4.53,5.09,7.15,null,null,null,null,16.770000000000003]
["2012",103.05000000000001,38.42,73.39,106.22999999999999,321.08999999999997,null,15,null,null,null,7.29,7.29,null,"2010-11-18",4.41,5.1100000000000003,7.28,null,null,null,null,16.8]
["2012-01-12",4.47,null,4.09,5.9,14.459999999999999,null,16,null,null,null,6.9,6.9,null,"2010-12-02",4.55,5.03,7.31,null,null,null,null,16.89]
["2012-01-19",4.05,null,4.25,6.02,14.32,null,17,null,null,null,6.41,6.41,null,"2010-12-09",4.29,4.76,7.18,7.18,null,null,null,23.41]
["2012-01-26",7.8,null,3.49,null,11.29,null,18,null,null,null,6.12,6.12,null,"2011"]
["2012-02-02",3.23,null,3.6,5.31,12.14,null,19,null,null,null,7.07,7.07,null,"2011-01-20",4.7300000000000004,null,8.26,6.14,5.34,null,null,24.47]
["2012-02-09",3.88,null,null,5.19,9.07,null,20,null,null,null,7.87,7.87,null,"2011-01-27",4.59,null,7.93,5.83,4.92,null,null,23.270000000000003]
["2012-02-16",7.18,null,3.45,4.38,15.009999999999998,null,21,null,null,null,6.85,6.85,null,"2011-02-03",4.37,null,7.29,4.95,4.78,null,null,21.39]
["2012-02-23",3.7,null,3.43,5.0199999999999996,12.15,null,22,null,null,null,8.42,8.42,null,"2011-02-10",3.81,null,6.9,5.03,4.59,null,null,20.330000000000002]
["2012-03-01",3.77,null,3.77,4.95,12.49,null,23,null,null,null,6.9,6.9,null,"2011-02-17",4.1100000000000003,null,6.41,4.33,4.07,null,null,18.920000000000002]
["2012-03-08",3.42,null,3.66,4.8899999999999997,11.969999999999999,null,24,null,null,null,6.45,6.45,null,"2011-02-24",3.79,null,6.12,4.59,4.5,null,null,19]
["2012-03-15",4,4.75,null,4.87,13.620000000000001,null,25,null,null,null,7.29,7.29,null,"2011-03-17",4.1500000000000004,null,null,4.08,4.1900000000000004,null,null,12.420000000000002]
["2012-03-22",6.73,3.87,null,null,10.600000000000001,null,26,null,null,null,7.29,7.29,null,"2011-03-24",4.46,null,7.07,5.15,4.3600000000000003,null,null,21.04]
["2012-03-29",3.14,3.48,null,null,6.62,null,"Season 8",null,null,null,129.25,129.25,null,"2011-04-14",3.49,null,7.87,5.16,4.45,null,null,20.97]
["2012-04-05",2.79,3,null,null,5.79,null,1,null,null,null,7.64,7.64,null,"2011-04-21",3.17,null,6.85,4.88,4.5999999999999996,null,null,19.5]
["2012-04-12",2.98,3.09,null,4.3899999999999997,10.46,null,2,null,null,null,6.7,6.7,null,"2011-04-28",3.35,null,8.42,4.71,null,3.95,3.95,24.38]
["2012-04-19",3.06,2.77,3.46,4.3499999999999996,13.639999999999999,null,3,null,null,null,5.82,5.82,null,"2011-05-05",3.49,null,6.9,5.0599999999999996,4.2,null,null,19.649999999999999]
["2012-04-26",3.47,3.21,3.17,4.17,14.02,null,4,null,null,null,6.08,6.08,null,"2011-05-12",3.32,null,6.45,4.55,3.54,null,null,17.86]
["2012-05-03",3.04,3.2,3.26,4.4400000000000004,13.940000000000001,null,5,null,null,null,5.53,5.53,null,"2011-05-19",null,null,7.29,7.29,4.2699999999999996,3.72,null,22.57]
["2012-05-10",2.92,2.99,3.42,4.49,13.82,null,6,null,null,null,6.15,6.15,null,"2011-09-22",3.93,4.1100000000000003,7.64,null,null,null,null,15.68]
["2012-05-17",2.84,8.06,null,null,10.9,null,7,null,null,null,5.96,5.96,null,"2011-09-29",3.98,4.33,6.7,null,null,null,null,15.010000000000002]
["2012-09-20",null,null,3.5,4.28,7.78,null,8,null,null,null,5.5,5.5,null,"2011-10-06",3.35,4.1500000000000004,5.82,null,null,null,null,13.32]
["2012-09-27",null,null,3.27,4.13,7.4,null,9,null,null,null,5.71,5.71,null,"2011-10-13",3.78,3.99,6.08,null,null,null,null,13.85]
["2012-10-04",3.46,null,3.53,4.1399999999999997,11.129999999999999,null,10,null,null,null,5.79,5.79,null,"2011-10-27",3.42,3.9,5.53,null,null,null,null,12.850000000000001]
["2012-10-11",3.4,null,null,null,3.4,null,11,null,null,null,5.9,5.9,null,"2011-11-03",3.84,4,6.15,null,null,null,null,13.99]
["2012-10-18",3.04,null,3.46,4.28,10.780000000000001,null,12,null,null,null,6.02,6.02,null,"2011-11-10",3.49,3.66,5.96,null,null,null,null,13.11]
["2012-10-25",3.13,null,3.34,4,10.469999999999999,null,13,null,null,null,5.31,5.31,null,"2011-11-17",3.62,3.68,5.5,null,null,null,null,12.8]
["2012-10-31",3.38,null,null,null,3.38,null,14,null,null,null,5.19,5.19,null,"2011-12-01",3.74,3.69,5.71,null,null,null,null,13.14]
["2012-11-08",null,null,3.46,4.83,8.2899999999999991,null,15,null,null,null,4.38,4.38,null,"2011-12-08",3.6,3.64,5.79,null,null,null,null,13.030000000000001]
["2012-11-15",3.34,null,3.52,4.16,11.02,null,16,null,null,null,5.0199999999999996,5.0199999999999996,null,"2012"]
["2012-11-29",3.61,null,2.99,3.88,10.48,null,17,null,null,null,4.95,4.95,null,"2012-01-12",4.47,null,5.9,4.09,null,null,null,14.46]
["2012-12-06",3.22,null,3.27,4.16,10.65,null,18,null,null,null,4.8899999999999997,4.8899999999999997,null,"2012-01-19",4.05,null,6.02,4.25,null,null,null,14.32]
["2013",20.8,37.74,70.03,67.58,196.14999999999995,null,19,null,null,null,4.87,4.87,null,"2012-01-26",null,null,3.82,7.4700000000000006,null,null,null,11.290000000000001]
["2013-01-10",3.79,null,null,4.54,8.33,null,20,null,null,null,4.3899999999999997,4.3899999999999997,null,"2012-02-02",3.23,null,5.31,3.6,null,null,null,12.139999999999999]
["2013-01-17",3.44,null,3.92,4.1500000000000004,11.51,null,21,null,null,null,4.3499999999999996,4.3499999999999996,null,"2012-02-09",3.88,null,5.19,null,null,null,null,9.07]
["2013-01-24",3.81,null,3.94,4.1900000000000004,11.940000000000001,null,22,null,null,null,4.17,4.17,null,"2012-02-16",7.18,null,4.38,3.45,null,null,null,15.009999999999998]
["2013-01-31",9.76,null,null,8.42,18.18,null,23,null,null,null,4.4400000000000004,4.4400000000000004,null,"2012-02-23",3.7,null,5.0199999999999996,3.43,null,null,null,12.149999999999999]
["2013-02-07",null,3.88,3.76,4.1500000000000004,11.79,null,24,null,null,null,4.49,4.49,null,"2012-03-01",3.77,null,4.95,3.77,null,null,null,12.49]
["2013-02-14",null,2.76,3.18,4.0599999999999996,10,null,"Season 9",null,null,null,105.44,105.44,null,"2012-03-08",3.42,null,4.8899999999999997,3.66,null,null,null,11.969999999999999]
["2013-02-21",null,3.08,6.02,null,9.1,null,1,null,null,null,4.28,4.28,null,"2012-03-15",4.75,4,4.87,null,null,null,null,13.620000000000001]
["2013-02-28",null,2.83,null,null,2.83,null,2,null,null,null,4.13,4.13,null,"2012-03-22",3.87,6.73,null,null,null,null,null,10.600000000000001]
["2013-03-07",null,3.29,null,null,3.29,null,3,null,null,null,4.1399999999999997,4.1399999999999997,null,"2012-03-29",3.48,3.14,null,null,null,null,null,6.62]
["2013-03-14",null,2.58,3,3.54,9.120000000000001,null,4,null,null,null,4.28,4.28,null,"2012-04-05",3,2.79,null,null,null,null,null,5.79]
["2013-03-21",null,2.95,null,null,2.95,null,5,null,null,null,4,4,null,"2012-04-12",3.09,2.98,4.3899999999999997,null,null,null,null,10.46]
["2013-04-04",null,2.3199999999999998,2.93,3.44,8.69,null,6,null,null,null,4.83,4.83,null,"2012-04-19",2.77,3.06,4.3499999999999996,3.46,null,null,null,13.64]
["2013-04-11",null,2.84,3.15,3.83,9.82,null,7,null,null,null,4.16,4.16,null,"2012-04-26",3.21,3.47,4.17,3.17,null,null,null,14.02]
["2013-04-18",null,3.13,6.6899999999999995,null,9.82,null,8,null,null,null,3.88,3.88,null,"2012-05-03",3.2,3.04,4.4400000000000004,3.26,null,null,null,13.94]
["2013-04-25",null,2.33,2.59,3.25,8.17,null,9,null,null,null,4.16,4.16,null,"2012-05-10",2.99,2.92,4.49,3.42,null,null,null,13.82]
["2013-05-02",null,2.67,2.99,3.51,9.17,null,10,null,null,null,4.54,4.54,null,"2012-05-17",2.97,2.84,2.61,2.48,null,null,null,10.9]
["2013-05-09",null,3.08,null,9.1199999999999992,12.2,null,11,null,null,null,4.1500000000000004,4.1500000000000004,null,"2012-09-20",null,null,4.28,3.5,null,null,null,7.78]
["2013-05-16",null,null,null,11.38,11.38,null,12,null,null,null,4.1900000000000004,4.1900000000000004,null,"2012-09-27",null,null,4.13,3.27,null,null,null,7.4]
["2013-09-26",null,null,6.54,null,6.54,null,13,null,null,null,4.45,4.45,null,"2012-10-04",3.46,null,4.1399999999999997,3.53,null,null,null,11.129999999999999]
["2013-10-03",null,null,3.14,null,3.14,null,14,null,null,null,3.97,3.97,null,"2012-10-11",3.4,null,null,null,null,null,null,3.4]
["2013-10-10",null,null,3.23,null,3.23,null,15,null,null,null,4.1500000000000004,4.1500000000000004,null,"2012-10-18",3.04,null,4.28,3.46,null,null,null,10.780000000000001]
["2013-10-17",null,null,3.27,null,3.27,null,16,null,null,null,4.0599999999999996,4.0599999999999996,null,"2012-10-25",3.13,null,4,3.34,null,null,null,10.469999999999999]
["2013-11-14",null,null,6.06,null,6.06,null,17,null,null,null,3.54,3.54,null,"2012-11-08",null,null,4.83,3.46,null,null,null,8.2899999999999991]
["2013-11-21",null,null,5.62,null,5.62,null,18,null,null,null,3.44,3.44,null,"2012-11-15",3.34,null,4.16,3.52,null,null,null,11.02]
["2014",null,39.03,36.769999999999996,null,75.800000000000011,null,19,null,null,null,3.83,3.83,null,"2012-11-29",3.61,null,3.88,2.99,null,null,null,10.48]
["2014-01-02",null,6.98,null,null,6.98,null,20,null,null,null,3.25,3.25,null,"2012-12-06",3.22,null,4.16,3.27,null,null,null,10.65]
["2014-01-09",null,3.58,3.43,null,7.01,null,21,null,null,null,3.51,3.51,null,"2013"]
["2014-01-16",null,3.07,3.05,null,6.1199999999999992,null,22,null,null,null,4.5599999999999996,4.5599999999999996,null,"2013-01-10",3.79,null,4.54,null,null,null,null,8.33]
["2014-01-23",null,3.02,2.98,null,6,null,23,null,null,null,4.5599999999999996,4.5599999999999996,null,"2013-01-17",3.44,3.92,4.1500000000000004,null,null,null,null,11.51]
["2014-01-30",null,3.01,3.03,null,6.0399999999999991,null,24,null,null,null,5.69,5.69,null,"2013-01-24",3.81,3.94,4.1900000000000004,null,null,null,null,11.940000000000001]
["2014-02-27",null,2.56,2.52,null,5.08,null,25,null,null,null,5.69,5.69,null,"2013-01-31",9.76,null,8.42,null,null,null,null,18.18]
["2014-03-06",null,2.79,2.95,null,5.74,null,"Grand Total",723.05000000000007,381.50999999999993,482.26999999999987,1479.130000000001,3065.9599999999982,null,"2013-02-07",3.88,3.76,4.1500000000000004,null,null,null,null,11.79]
["2014-03-13",null,2.77,2.72,null,5.49,null,null,null,null,null,null,null,null,"2013-02-14",2.76,3.18,4.0599999999999996,null,null,null,null,10]
["2014-03-20",null,3.32,3.05,null,6.3699999999999992,null,null,null,null,null,null,null,null,"2013-02-21",3.08,6.02,null,null,null,null,null,9.1]
["2014-04-03",null,2.5,2.67,null,5.17,null,null,null,null,null,null,null,null,"2013-02-28",2.83,null,null,null,null,null,null,2.83]
["2014-04-10",null,2.56,2.56,null,5.12,null,null,null,null,null,null,null,null,"2013-03-07",3.29,null,null,null,null,null,null,3.29]
["2014-04-17",null,2.87,2.39,null,5.26,null,null,null,null,null,null,null,null,"2013-03-14",2.58,3,3.54,null,null,null,null,9.120000000000001]
["2014-04-24",null,null,5.42,null,5.42,null,null,null,null,null,null,null,null,"2013-03-21",2.95,null,null,null,null,null,null,2.95]
["2015",null,null,43.31,null,43.31,null,null,null,null,null,null,null,null,"2013-04-04",2.3199999999999998,2.93,3.44,null,null,null,null,8.69]
["2015-01-13",null,null,7,null,7,null,null,null,null,null,null,null,null,"2013-04-11",2.84,3.15,3.83,null,null,null,null,9.82]
["2015-01-20",null,null,7.17,null,7.17,null,null,null,null,null,null,null,null,"2013-04-18",3.13,6.6899999999999995,null,null,null,null,null,9.82]
["2015-01-27",null,null,6.45,null,6.45,null,null,null,null,null,null,null,null,"2013-04-25",2.33,2.59,3.25,null,null,null,null,8.17]
["2015-02-03",null,null,3.45,null,3.45,null,null,null,null,null,null,null,null,"2013-05-02",2.67,2.99,3.51,null,null,null,null,9.17]
["2015-02-10",null,null,5.53,null,5.53,null,null,null,null,null,null,null,null,"2013-05-09",3.08,null,4.5599999999999996,4.5599999999999996,null,null,null,12.2]
["2015-02-17",null,null,5.41,null,5.41,null,null,null,null,null,null,null,null,"2013-05-16",null,null,5.69,5.69,null,null,null,11.38]
["2015-02-24",null,null,8.3000000000000007,null,8.3000000000000007,null,null,null,null,null,null,null,null,"2013-09-26",6.54,null,null,null,null,null,null,6.54]
["2015-03-17",null,null,null,null,null,null,null,null,null,null,null,null,null,"2013-10-03",3.14,null,null,null,null,null,null,3.14]
["2015-03-24",null,null,null,null,null,null,null,null,null,null,null,null,null,"2013-10-10",3.23,null,null,null,null,null,null,3.23]
["2015-03-31",null,null,null,null,null,null,null,null,null,null,null,null,null,"2013-10-17",3.27,null,null,null,null,null,null,3.27]
["2015-04-07",null,null,null,null,null,null,null,null,null,null,null,null,null,"2013-11-14",6.06,null,null,null,null,null,null,6.06]
["2015-04-14",null,null,null,null,null,null,null,null,null,null,null,null,null,"2013-11-21",5.62,null,null,null,null,null,null,5.62]
["2015-04-21",null,null,null,null,null,null,null,null,null,null,null,null,null,"2014"]
["2015-04-28",null,null,null,null,null,null,null,null,null,null,null,null,null,"2014-01-02",6.98,null,null,null,null,null,null,6.98]
["2015-05-05",null,null,null,null,null,null,null,null,null,null,null,null,null,"2014-01-09",3.58,3.43,null,null,null,null,null,7.01]
["2015-05-12",null,null,null,null,null,null,null,null,null,null,null,null,null,"2014-01-16",3.07,3.05,null,null,null,null,null,6.1199999999999992]
["2015-05-19",null,null,null,null,null,null,null,null,null,null,null,null,null,"2014-01-23",3.02,2.98,null,null,null,null,null,6]
["2015-05-26",null,null,null,null,null,null,null,null,null,null,null,null,null,"2014-01-30",3.01,3.03,null,null,null,null,null,6.0399999999999991]
["2015-06-02",null,null,null,null,null,null,null,null,null,null,null,null,null,"2014-02-27",2.56,2.52,null,null,null,null,null,5.08]
["Grand Total",723.04999999999984,381.50999999999988,482.27,1479.1300000000006,3065.9600000000005,null,null,null,null,null,null,null,null,"2014-03-06",2.79,2.95,null,null,null,null,null,5.74]
[null,null,null,null,null,null,null,null,null,null,null,null,null,null,"2014-03-13",2.77,2.72,null,null,null,null,null,5.49]
[null,null,null,null,null,null,null,null,null,null,null,null,null,null,"2014-03-20",3.32,3.05,null,null,null,null,null,6.3699999999999992]
[null,null,null,null,null,null,null,null,null,null,null,null,null,null,"2014-04-03",2.5,2.67,null,null,null,null,null,5.17]
[null,null,null,null,null,null,null,null,null,null,null,null,null,null,"2014-04-10",2.56,2.56,null,null,null,null,null,5.12]
[null,null,null,null,null,null,null,null,null,null,null,null,null,null,"2014-04-17",2.87,2.39,null,null,null,null,null,5.26]
[null,null,null,null,null,null,null,null,null,null,null,null,null,null,"2014-04-24",null,2.71,2.71,null,null,null,null,5.42]
[null,null,null,null,null,null,null,null,null,null,null,null,null,null,"Grand Total",462.83999999999986,616.25999999999965,969.44999999999982,722.83999999999992,57.81,7.67,3.95,2840.82]

{"sheet":"30 Rock Season Info","index":4,"n_rows":8,"n_cols":12,"rows_kept":8,"cut":false,"hidden":false,"merged":[]}
["Season Title","Show","Season","Timeslot (ET)","Episodes","Premiere Date","Premiere\nViewers\n(in millions)","Finale Date","Finale\nViewers\n(in millions)","TV Season","Rank","Avg. Viewers\n(in millions)"]
[{"$f":"B2 &\" S\" & C2","v":"30 Rock S1"},"30 Rock",1,"Wednesday 8:00 pm (October 11–November 1, 2006)\nThursday 9:30 pm (November 16, 2006–March 8, 2007)\nThursday 9:00 pm (April 5–26, 2007)",21,"2006-10-11",8.1300000000000008,"2007-04-26",4.72,"2006-07",102,5.8]
[{"$f":"B3 &\" S\" & C3","v":"30 Rock S2"},"30 Rock",2,"Thursday 8:30 pm (October 4, 2007–April 17, 2008)\nThursday 9:00 pm (December 13, 2007)\nThursday 9:30 pm (April 24–May 8, 2008)",15,"2007-10-04",7.33,"2008-05-08",5.45,"2007-08",111,6.5]
["30 Rock S3","30 Rock",3,"Thursday 9:30 pm (October 30, 2008–May 14, 2009)",22,"2008-10-30",8.66,"2009-05-14",5.7,"2008-09",69,7.5]
["30 Rock S4","30 Rock",4,"Thursday 9:30 pm (October 15, 2009–May 20, 2010)\nThursday 9:00 pm (January 14, 2010)\nThursday 8:30 pm (April 22, 2010)",22,"2009-10-15",6.39,"2010-05-20",5.36,"2009-10",86,5.9]
["30 Rock S5","30 Rock",5,"Thursday 8:30 pm (September 23 – December 9, 2010)\nThursday 10:00 pm (January 20 – May 5, 2011)\nThursday 10:30 pm (April 28, 2011)",23,"2010-09-23",5.91,"2011-05-05",4.2,"2010-11",106,5.3]
["30 Rock S6","30 Rock",6,"Thursday 8:00 pm (January 12 – March 8, 2012)\nThursday 9:00 pm (January 26, 2012)\nThursday 8:30 pm (March 15 – May 17, 2012)",22,"2012-01-12",4.47,"2012-05-17",2.84,"2011-12",130,4.5999999999999996]
["30 Rock S7","30 Rock",7,"Thursday 8:00 pm (October 4, 2012 – January 31, 2013)\nWednesday 8:00 pm (October 31, 2012)",13,"2012-10-04",3.46,"2013-01-31",4.88,"2012-13",99,4.5999999999999996]

{"sheet":"Parks and Rec Season Info","index":5,"n_rows":8,"n_cols":12,"rows_kept":8,"cut":false,"hidden":false,"merged":[]}
["Season Title","Show","Season","Timeslot (ET)","Episodes","Premiere Date","Premiere\nViewers\n(in millions)","Finale Date","Finale\nViewers\n(in millions)","TV Season","Rank","Avg. Viewers\n(in millions)"]
[{"$f":"B2 & \" S\" & C2","v":"Parks and Rec S1"},"Parks and Rec",1,"Thursday 8:30 pm",6,"April 9, 2009 (2009-04-09)",6.88,"May 14, 2009 (2009-05-14)",4.29,"2008-09",96,6]
[{"$f":"B3 & \" S\" & C3","v":"Parks and Rec S2"},"Parks and Rec",2,"Thursday 8:30 pm",24,"September 17, 2009 (2009-09-17)",4.8899999999999997,"May 20, 2010 (2010-05-20)",4.57,"2009-10",108,4.5999999999999996]
["Parks and Rec S3","Parks and Rec",3,"Thursday 9:30 pm",16,"January 20, 2011 (2011-01-20)",6.14,"May 19, 2011 (2011-05-19)",3.72,"2010-11",116,5.0999999999999996]
["Parks and Rec S4","Parks and Rec",4,"Thursday 8:30 pm (1–10)\nThursday 9:30 pm (11–22)",22,"September 22, 2011 (2011-09-22)",4.1100000000000003,"May 10, 2012 (2012-05-10)",3.42,"2011-12",134,4.4000000000000004]
["Parks and Rec S5","Parks and Rec",5,"Thursday 9:30 pm (1–9)\nThursday 8:30 pm (10–22)",22,"September 20, 2012 (2012-09-20)",3.5,"May 2, 2013 (2013-05-02)",2.99,"2012-13",111,4.0599999999999996]
["Parks and Rec S6","Parks and Rec",6,"Thursday 8:00 pm (1–9)\nThursday 8:30 pm (10–22)",22,"September 26, 2013 (2013-09-26)",3.27,"April 24, 2014 (2014-04-24)",2.71,"2013-14",115,3.76]
["Parks and Rec S7","Parks and Rec",7,"Tuesday 8:00 pm & 8:30 pm",13,"January 13, 2015 (2015-01-13)",3.75,"February 24, 2015 (2015-02-24)",4.1500000000000004,"2014-15",119,4.57]

{"sheet":"The Office Season Info","index":6,"n_rows":10,"n_cols":12,"rows_kept":10,"cut":false,"hidden":false,"merged":[]}
["Season Title","Show","Season","Timeslot (ET)","Episodes","Premiere Date","Premiere\nViewers\n(in millions)","Finale Date","Finale\nViewers\n(in millions)","TV Season","Rank","Avg. Viewers\n(in millions)"]
[{"$f":"B2 & \" S\" & C2","v":"The Office S1"},"The Office",1,"Thursday 9:30 pm (1)\nTuesday 9:30 pm (2 –6)",6,"March 24, 2005 (2005-03-24)",11.23,"April 26, 2005 (2005-04-26)",4.83,"2004-05",102,5.4]
[{"$f":"B3 & \" S\" & C3","v":"The Office S2"},"The Office",2,"Tuesday 9:30 pm (1 –10)\nThursday 9:30 pm (11 –22)",22,"September 20, 2005 (2005-09-20)",9,"May 11, 2006 (2006-05-11)",7.66,"2005-06",67,8]
["The Office S3","The Office",3,"Thursday 8:30 pm",25,"September 21, 2006 (2006-09-21)",9.11,"May 17, 2007 (2007-05-17)",7.88,"2006-07",68,8.3000000000000007]
["The Office S4","The Office",4,"Thursday 9:00 pm",19,"September 27, 2007 (2007-09-27)",9.65,"May 15, 2008 (2008-05-15)",8.2100000000000009,"2007-08",77,8.0399999999999991]
["The Office S5","The Office",5,"Thursday 9:00 pm",28,"September 25, 2008 (2008-09-25)",9.34,"May 14, 2009 (2009-05-14)",6.77,"2008-09",52,9.0399999999999991]
["The Office S6","The Office",6,"Thursday 9:00 pm",26,"September 17, 2009 (2009-09-17)",8.2100000000000009,"May 20, 2010 (2010-05-20)",6.64,"2009-10",41,8.73]
["The Office S7","The Office",7,"Thursday 9:00 pm",26,"September 23, 2010 (2010-09-23)",8.48,"May 19, 2011 (2011-05-19)",7.29,"2010-11",53,7.73]
["The Office S8","The Office",8,"Thursday 9:00 pm",24,"September 22, 2011 (2011-09-22)",7.64,"May 10, 2012 (2012-05-10)",4.49,"2011-12",78,6.51]
["The Office S9","The Office",9,"Thursday 9:00 pm",25,"September 20, 2012 (2012-09-20)",4.28,"May 16, 2013 (2013-05-16)",5.69,"2012-13",88,5.0599999999999996]

{"sheet":"Community Season Info","index":7,"n_rows":7,"n_cols":12,"rows_kept":7,"cut":false,"hidden":false,"merged":[]}
["Season Title","Show","Season","Timeslot (ET)","Episodes","Premiere Date","Premiere\nViewers\n(in millions)","Finale Date","Finale\nViewers\n(in millions)","TV Season","Rank","Avg. Viewers\n(in millions)"]
[{"$f":"B2 & \" S\" & C2","v":"Community S1"},"Community",1,"Thursday 9:30 pm (1 –3)\nThursday 8:00 pm (4 –25)",25,"September  17,  2009  (2009-09-17)",7.89,"May  20,  2010  (2010-05-20)",4.43,"2009-10",97,5]
[{"$f":"B3 & \" S\" & C3","v":"Community S2"},"Community",2,"Thursday 8:00 pm",24,"September  23,  2010  (2010-09-23)",5.01,"May  12,  2011  (2011-05-12)",3.32,"2010-11",138,4.4400000000000004]
["Community S3","Community",3,"Thursday 8:00 pm",22,"September  22,  2011  (2011-09-22)",3.93,"May  17,  2012  (2012-05-17)",2.48,"2011-12",144,4.03]
["Community S4","Community",4,"Thursday 8:00 pm",13,"February  7,  2013  (2013-02-07)",3.88,"May  9,  2013  (2013-05-09)",3.08,"2012-13",133,3.58]
["Community S5","Community",5,"Thursday 8:00 pm",13,"January  2,  2014  (2014-01-02)",3.49,"April  17,  2014  (2014-04-17)",2.87,"2013-14",96,3]
["Community S6","Community",6,"N/A",13,"March  17,  2015  (2015-03-17)",null,"June  2,  2015  (2015-06-02)",null,"2014-15"]